wanconfig.c:87:36: error: linux/wanpipe_version.h: No such file or directory
wanconfig.c:88:36: error: linux/wanpipe_defines.h: No such file or directory
wanconfig.c:89:32: error: linux/wanpipe_cfg.h: No such file or directory
wanconfig.c:90:28: error: linux/wanpipe.h: No such file or directory
wanconfig.c:183: error: ‘WAN_IFNAME_SZ’ undeclared here (not in a function)
wanconfig.c:194: error: expected specifier-qualifier-list before ‘wanif_conf_t’
wanconfig.c:201: error: ‘WAN_DRVNAME_SZ’ undeclared here (not in a function)
wanconfig.c:208: error: expected specifier-qualifier-list before ‘wandev_conf_t’
wanconfig.c:284: error: expected ‘)’ before ‘*’ token
wanconfig.c:285: error: expected ‘)’ before ‘*’ token
wanconfig.c:492: error: expected specifier-qualifier-list before ‘wandev_conf_t’
wanconfig.c:522: error: expected specifier-qualifier-list before ‘wandev_conf_t’
wanconfig.c:522: error: expected ‘}’ before ‘)’ token
wanconfig.c:522: error: expected ‘,’ or ‘;’ before ‘)’ token
wanconfig.c:522: error: expected identifier or ‘(’ before ‘,’ token
wanconfig.c:523: error: expected identifier or ‘(’ before ‘,’ token
wanconfig.c:524: error: expected identifier or ‘(’ before ‘,’ token
wanconfig.c:525: error: expected identifier or ‘(’ before ‘,’ token
wanconfig.c:526: error: expected identifier or ‘(’ before ‘,’ token
wanconfig.c:527: error: expected identifier or ‘(’ before ‘,’ token
wanconfig.c:528: error: expected identifier or ‘(’ before ‘,’ token
wanconfig.c:529: error: expected identifier or ‘(’ before ‘,’ token
wanconfig.c:530: error: expected identifier or ‘(’ before ‘,’ token
wanconfig.c:531: error: expected identifier or ‘(’ before ‘,’ token
wanconfig.c:532: error: expected identifier or ‘(’ before ‘,’ token
wanconfig.c:540: error: expected identifier or ‘(’ before ‘,’ token
wanconfig.c:541: error: expected identifier or ‘(’ before ‘,’ token
wanconfig.c:542: error: expected identifier or ‘(’ before ‘,’ token
wanconfig.c:543: error: expected identifier or ‘(’ before ‘,’ token
wanconfig.c:544: error: expected identifier or ‘(’ before ‘,’ token
wanconfig.c:545: error: expected identifier or ‘(’ before ‘,’ token
wanconfig.c:548: error: expected identifier or ‘(’ before ‘,’ token
wanconfig.c:549: error: expected identifier or ‘(’ before ‘,’ token
wanconfig.c:550: error: expected identifier or ‘(’ before ‘,’ token
wanconfig.c:552: error: expected identifier or ‘(’ before ‘,’ token
wanconfig.c:553: error: expected identifier or ‘(’ before ‘,’ token
wanconfig.c:554: error: expected identifier or ‘(’ before ‘,’ token
wanconfig.c:555: error: expected identifier or ‘(’ before ‘,’ token
wanconfig.c:556: error: expected identifier or ‘(’ before ‘,’ token
wanconfig.c:557: error: expected identifier or ‘(’ before ‘,’ token
wanconfig.c:558: error: expected identifier or ‘(’ before ‘,’ token
wanconfig.c:560: error: expected identifier or ‘(’ before ‘,’ token
wanconfig.c:561: error: expected identifier or ‘(’ before ‘,’ token
wanconfig.c:562: error: expected identifier or ‘(’ before ‘,’ token
wanconfig.c:564: error: expected identifier or ‘(’ before ‘,’ token
wanconfig.c:565: error: expected identifier or ‘(’ before ‘,’ token
wanconfig.c:566: error: expected identifier or ‘(’ before ‘,’ token
wanconfig.c:567: error: expected identifier or ‘(’ before ‘,’ token
wanconfig.c:568: error: expected identifier or ‘(’ before ‘,’ token
wanconfig.c:569: error: expected identifier or ‘(’ before ‘,’ token
wanconfig.c:570: error: expected identifier or ‘(’ before ‘,’ token
wanconfig.c:571: error: expected identifier or ‘(’ before ‘,’ token
wanconfig.c:572: error: expected identifier or ‘(’ before ‘,’ token
wanconfig.c:573: error: expected identifier or ‘(’ before ‘,’ token
wanconfig.c:574: error: expected identifier or ‘(’ before ‘,’ token
wanconfig.c:575: error: expected identifier or ‘(’ before ‘,’ token
wanconfig.c:576: error: expected identifier or ‘(’ before ‘,’ token
wanconfig.c:579: error: expected identifier or ‘(’ before ‘,’ token
wanconfig.c:580: error: expected identifier or ‘(’ before ‘,’ token
wanconfig.c:581: error: expected identifier or ‘(’ before ‘,’ token
wanconfig.c:583: error: expected identifier or ‘(’ before ‘,’ token
wanconfig.c:584: error: expected identifier or ‘(’ before ‘,’ token
wanconfig.c:586: error: expected identifier or ‘(’ before ‘,’ token
wanconfig.c:588: error: expected identifier or ‘(’ before ‘,’ token
wanconfig.c:589: error: expected identifier or ‘(’ before ‘,’ token
wanconfig.c:590: error: expected identifier or ‘(’ before ‘,’ token
wanconfig.c:591: error: expected identifier or ‘(’ before ‘,’ token
wanconfig.c:592: error: expected identifier or ‘(’ before ‘,’ token
wanconfig.c:593: error: expected identifier or ‘(’ before ‘,’ token
wanconfig.c:594: error: expected identifier or ‘(’ before ‘,’ token
wanconfig.c:595: error: expected identifier or ‘(’ before ‘,’ token
wanconfig.c:596: error: expected identifier or ‘(’ before ‘,’ token
wanconfig.c:597: error: expected identifier or ‘(’ before ‘,’ token
wanconfig.c:598: error: expected identifier or ‘(’ before ‘,’ token
wanconfig.c:599: error: expected identifier or ‘(’ before ‘,’ token
wanconfig.c:600: error: expected identifier or ‘(’ before ‘,’ token
wanconfig.c:601: error: expected identifier or ‘(’ before ‘,’ token
wanconfig.c:602: error: expected identifier or ‘(’ before ‘,’ token
wanconfig.c:603: error: expected identifier or ‘(’ before ‘,’ token
wanconfig.c:604: error: expected identifier or ‘(’ before ‘,’ token
wanconfig.c:605: error: expected identifier or ‘(’ before ‘,’ token
wanconfig.c:606: error: expected identifier or ‘(’ before ‘,’ token
wanconfig.c:607: error: expected identifier or ‘(’ before ‘,’ token
wanconfig.c:608: error: expected identifier or ‘(’ before ‘,’ token
wanconfig.c:609: error: expected identifier or ‘(’ before ‘,’ token
wanconfig.c:611: error: expected identifier or ‘(’ before ‘,’ token
wanconfig.c:612: error: expected identifier or ‘(’ before ‘,’ token
wanconfig.c:628: error: expected identifier or ‘(’ before ‘}’ token
wanconfig.c:632: error: expected specifier-qualifier-list before ‘wan_ppp_conf_t’
wanconfig.c:632: error: initializer element is not constant
wanconfig.c:632: error: (near initialization for ‘ppp_conftab[0].offset’)
wanconfig.c:632: error: expected ‘}’ before ‘)’ token
wanconfig.c:632: error: expected ‘,’ or ‘;’ before ‘)’ token
wanconfig.c:632: error: expected identifier or ‘(’ before ‘,’ token
wanconfig.c:633: error: expected identifier or ‘(’ before ‘,’ token
wanconfig.c:634: error: expected identifier or ‘(’ before ‘,’ token
wanconfig.c:636: error: expected identifier or ‘(’ before ‘,’ token
wanconfig.c:637: error: expected identifier or ‘(’ before ‘,’ token
wanconfig.c:638: error: expected identifier or ‘(’ before ‘,’ token
wanconfig.c:639: error: expected identifier or ‘(’ before ‘,’ token
wanconfig.c:640: error: expected identifier or ‘(’ before ‘,’ token
wanconfig.c:641: error: expected identifier or ‘(’ before ‘,’ token
wanconfig.c:642: error: expected identifier or ‘(’ before ‘,’ token
wanconfig.c:643: error: expected identifier or ‘(’ before ‘,’ token
wanconfig.c:645: error: expected identifier or ‘(’ before ‘}’ token
wanconfig.c:652: error: expected specifier-qualifier-list before ‘wan_chdlc_conf_t’
wanconfig.c:652: error: initializer element is not constant
wanconfig.c:652: error: (near initialization for ‘chdlc_conftab[0].offset’)
wanconfig.c:652: error: expected ‘}’ before ‘)’ token
wanconfig.c:652: error: expected ‘,’ or ‘;’ before ‘)’ token
wanconfig.c:652: error: expected identifier or ‘(’ before ‘,’ token
wanconfig.c:653: error: expected identifier or ‘(’ before ‘,’ token
wanconfig.c:654: error: expected identifier or ‘(’ before ‘,’ token
wanconfig.c:655: error: expected identifier or ‘(’ before ‘,’ token
wanconfig.c:656: error: expected identifier or ‘(’ before ‘,’ token
wanconfig.c:657: error: expected identifier or ‘(’ before ‘,’ token
wanconfig.c:658: error: expected identifier or ‘(’ before ‘,’ token
wanconfig.c:659: error: expected identifier or ‘(’ before ‘,’ token
wanconfig.c:660: error: expected identifier or ‘(’ before ‘,’ token
wanconfig.c:661: error: expected identifier or ‘(’ before ‘,’ token
wanconfig.c:663: error: expected identifier or ‘(’ before ‘}’ token
wanconfig.c:668: error: expected specifier-qualifier-list before ‘wan_sppp_if_conf_t’
wanconfig.c:668: error: initializer element is not constant
wanconfig.c:668: error: (near initialization for ‘sppp_conftab[0].offset’)
wanconfig.c:668: error: expected ‘}’ before ‘)’ token
wanconfig.c:668: error: expected ‘,’ or ‘;’ before ‘)’ token
wanconfig.c:668: error: expected identifier or ‘(’ before ‘,’ token
wanconfig.c:670: error: expected identifier or ‘(’ before ‘,’ token
wanconfig.c:671: error: expected identifier or ‘(’ before ‘,’ token
wanconfig.c:672: error: expected identifier or ‘(’ before ‘,’ token
wanconfig.c:674: error: expected identifier or ‘(’ before ‘,’ token
wanconfig.c:675: error: expected identifier or ‘(’ before ‘,’ token
wanconfig.c:676: error: expected identifier or ‘(’ before ‘,’ token
wanconfig.c:678: error: expected identifier or ‘(’ before ‘,’ token
wanconfig.c:679: error: expected identifier or ‘(’ before ‘,’ token
wanconfig.c:683: error: expected identifier or ‘(’ before ‘,’ token
wanconfig.c:686: error: expected identifier or ‘(’ before ‘}’ token
wanconfig.c:690: error: expected specifier-qualifier-list before ‘wan_fr_conf_t’
wanconfig.c:690: error: initializer element is not constant
wanconfig.c:690: error: (near initialization for ‘fr_conftab[0].offset’)
wanconfig.c:690: error: expected ‘}’ before ‘)’ token
wanconfig.c:690: error: expected ‘,’ or ‘;’ before ‘)’ token
wanconfig.c:690: error: expected identifier or ‘(’ before ‘,’ token
wanconfig.c:691: error: expected identifier or ‘(’ before ‘,’ token
wanconfig.c:692: error: expected identifier or ‘(’ before ‘,’ token
wanconfig.c:693: error: expected identifier or ‘(’ before ‘,’ token
wanconfig.c:694: error: expected identifier or ‘(’ before ‘,’ token
wanconfig.c:695: error: expected identifier or ‘(’ before ‘,’ token
wanconfig.c:696: error: expected identifier or ‘(’ before ‘,’ token
wanconfig.c:697: error: expected identifier or ‘(’ before ‘,’ token
wanconfig.c:698: error: expected identifier or ‘(’ before ‘,’ token
wanconfig.c:699: error: expected identifier or ‘(’ before ‘,’ token
wanconfig.c:700: error: expected identifier or ‘(’ before ‘,’ token
wanconfig.c:702: error: expected identifier or ‘(’ before ‘}’ token
wanconfig.c:706: error: expected specifier-qualifier-list before ‘wan_xilinx_conf_t’
wanconfig.c:706: error: initializer element is not constant
wanconfig.c:706: error: (near initialization for ‘xilinx_conftab[0].offset’)
wanconfig.c:706: error: expected ‘}’ before ‘)’ token
wanconfig.c:706: error: expected ‘,’ or ‘;’ before ‘)’ token
wanconfig.c:706: error: expected identifier or ‘(’ before ‘,’ token
wanconfig.c:707: error: expected identifier or ‘(’ before ‘,’ token
wanconfig.c:708: error: expected identifier or ‘(’ before ‘,’ token
wanconfig.c:709: error: expected identifier or ‘(’ before ‘,’ token
wanconfig.c:712: error: expected identifier or ‘(’ before ‘,’ token
wanconfig.c:714: error: expected identifier or ‘(’ before ‘}’ token
wanconfig.c:719: error: expected specifier-qualifier-list before ‘wan_bitstrm_conf_t’
wanconfig.c:719: error: initializer element is not constant
wanconfig.c:719: error: (near initialization for ‘bitstrm_conftab[0].offset’)
wanconfig.c:719: error: expected ‘}’ before ‘)’ token
wanconfig.c:719: error: expected ‘,’ or ‘;’ before ‘)’ token
wanconfig.c:719: error: expected identifier or ‘(’ before ‘,’ token
wanconfig.c:720: error: expected identifier or ‘(’ before ‘,’ token
wanconfig.c:721: error: expected identifier or ‘(’ before ‘,’ token
wanconfig.c:722: error: expected identifier or ‘(’ before ‘,’ token
wanconfig.c:723: error: expected identifier or ‘(’ before ‘,’ token
wanconfig.c:724: error: expected identifier or ‘(’ before ‘,’ token
wanconfig.c:725: error: expected identifier or ‘(’ before ‘,’ token
wanconfig.c:727: error: expected identifier or ‘(’ before ‘}’ token
wanconfig.c:731: error: expected specifier-qualifier-list before ‘wan_sdlc_conf_t’
wanconfig.c:731: error: initializer element is not constant
wanconfig.c:731: error: (near initialization for ‘sdlc_conftab[0].offset’)
wanconfig.c:731: error: expected ‘}’ before ‘)’ token
wanconfig.c:731: error: expected ‘,’ or ‘;’ before ‘)’ token
wanconfig.c:731: error: expected identifier or ‘(’ before ‘,’ token
wanconfig.c:732: error: expected identifier or ‘(’ before ‘,’ token
wanconfig.c:733: error: expected identifier or ‘(’ before ‘,’ token
wanconfig.c:734: error: expected identifier or ‘(’ before ‘,’ token
wanconfig.c:736: error: expected identifier or ‘(’ before ‘,’ token
wanconfig.c:737: error: expected identifier or ‘(’ before ‘,’ token
wanconfig.c:738: error: expected identifier or ‘(’ before ‘,’ token
wanconfig.c:739: error: expected identifier or ‘(’ before ‘,’ token
wanconfig.c:740: error: expected identifier or ‘(’ before ‘,’ token
wanconfig.c:742: error: expected identifier or ‘(’ before ‘,’ token
wanconfig.c:743: error: expected identifier or ‘(’ before ‘,’ token
wanconfig.c:744: error: expected identifier or ‘(’ before ‘,’ token
wanconfig.c:745: error: expected identifier or ‘(’ before ‘,’ token
wanconfig.c:746: error: expected identifier or ‘(’ before ‘,’ token
wanconfig.c:747: error: expected identifier or ‘(’ before ‘,’ token
wanconfig.c:749: error: expected identifier or ‘(’ before ‘,’ token
wanconfig.c:752: error: expected identifier or ‘(’ before ‘}’ token
wanconfig.c:757: error: expected specifier-qualifier-list before ‘wan_xdlc_conf_t’
wanconfig.c:757: error: initializer element is not constant
wanconfig.c:757: error: (near initialization for ‘xdlc_conftab[0].offset’)
wanconfig.c:757: error: expected ‘}’ before ‘)’ token
wanconfig.c:757: error: expected ‘,’ or ‘;’ before ‘)’ token
wanconfig.c:757: error: expected identifier or ‘(’ before ‘,’ token
wanconfig.c:758: error: expected identifier or ‘(’ before ‘,’ token
wanconfig.c:760: error: expected identifier or ‘(’ before ‘,’ token
wanconfig.c:761: error: expected identifier or ‘(’ before ‘,’ token
wanconfig.c:762: error: expected identifier or ‘(’ before ‘,’ token
wanconfig.c:764: error: expected identifier or ‘(’ before ‘,’ token
wanconfig.c:766: error: expected identifier or ‘(’ before ‘,’ token
wanconfig.c:767: error: expected identifier or ‘(’ before ‘,’ token
wanconfig.c:768: error: expected identifier or ‘(’ before ‘,’ token
wanconfig.c:770: error: expected identifier or ‘(’ before ‘,’ token
wanconfig.c:771: error: expected identifier or ‘(’ before ‘,’ token
wanconfig.c:772: error: expected identifier or ‘(’ before ‘,’ token
wanconfig.c:774: error: expected identifier or ‘(’ before ‘,’ token
wanconfig.c:777: error: expected identifier or ‘(’ before ‘}’ token
wanconfig.c:810: error: expected specifier-qualifier-list before ‘wan_atm_conf_t’
wanconfig.c:810: error: initializer element is not constant
wanconfig.c:810: error: (near initialization for ‘atm_conftab[0].offset’)
wanconfig.c:810: error: expected ‘}’ before ‘)’ token
wanconfig.c:810: error: expected ‘,’ or ‘;’ before ‘)’ token
wanconfig.c:810: error: expected identifier or ‘(’ before ‘,’ token
wanconfig.c:811: error: expected identifier or ‘(’ before ‘,’ token
wanconfig.c:812: error: expected identifier or ‘(’ before ‘,’ token
wanconfig.c:813: error: expected identifier or ‘(’ before ‘,’ token
wanconfig.c:814: error: expected identifier or ‘(’ before ‘,’ token
wanconfig.c:815: error: expected identifier or ‘(’ before ‘,’ token
wanconfig.c:816: error: expected identifier or ‘(’ before ‘,’ token
wanconfig.c:817: error: expected identifier or ‘(’ before ‘,’ token
wanconfig.c:819: error: expected identifier or ‘(’ before ‘}’ token
wanconfig.c:826: error: expected specifier-qualifier-list before ‘wan_atm_conf_if_t’
wanconfig.c:826: error: initializer element is not constant
wanconfig.c:826: error: (near initialization for ‘atm_if_conftab[0].offset’)
wanconfig.c:826: error: expected ‘}’ before ‘)’ token
wanconfig.c:826: error: expected ‘,’ or ‘;’ before ‘)’ token
wanconfig.c:826: error: expected identifier or ‘(’ before ‘,’ token
wanconfig.c:827: error: expected identifier or ‘(’ before ‘,’ token
wanconfig.c:828: error: expected identifier or ‘(’ before ‘,’ token
wanconfig.c:830: error: expected identifier or ‘(’ before ‘,’ token
wanconfig.c:831: error: expected identifier or ‘(’ before ‘,’ token
wanconfig.c:832: error: expected identifier or ‘(’ before ‘,’ token
wanconfig.c:833: error: expected identifier or ‘(’ before ‘,’ token
wanconfig.c:834: error: expected identifier or ‘(’ before ‘,’ token
wanconfig.c:835: error: expected identifier or ‘(’ before ‘,’ token
wanconfig.c:836: error: expected identifier or ‘(’ before ‘,’ token
wanconfig.c:839: error: expected identifier or ‘(’ before ‘,’ token
wanconfig.c:840: error: expected identifier or ‘(’ before ‘,’ token
wanconfig.c:841: error: expected identifier or ‘(’ before ‘,’ token
wanconfig.c:842: error: expected identifier or ‘(’ before ‘,’ token
wanconfig.c:843: error: expected identifier or ‘(’ before ‘,’ token
wanconfig.c:844: error: expected identifier or ‘(’ before ‘,’ token
wanconfig.c:845: error: expected identifier or ‘(’ before ‘,’ token
wanconfig.c:846: error: expected identifier or ‘(’ before ‘,’ token
wanconfig.c:849: error: expected identifier or ‘(’ before ‘}’ token
wanconfig.c:853: error: expected specifier-qualifier-list before ‘wan_xilinx_conf_if_t’
wanconfig.c:853: error: initializer element is not constant
wanconfig.c:853: error: (near initialization for ‘xilinx_if_conftab[0].offset’)
wanconfig.c:853: error: expected ‘}’ before ‘)’ token
wanconfig.c:853: error: expected ‘,’ or ‘;’ before ‘)’ token
wanconfig.c:853: error: expected identifier or ‘(’ before ‘,’ token
wanconfig.c:854: error: expected identifier or ‘(’ before ‘,’ token
wanconfig.c:855: error: expected identifier or ‘(’ before ‘,’ token
wanconfig.c:856: error: expected identifier or ‘(’ before ‘,’ token
wanconfig.c:857: error: expected identifier or ‘(’ before ‘,’ token
wanconfig.c:858: error: expected identifier or ‘(’ before ‘,’ token
wanconfig.c:859: error: expected identifier or ‘(’ before ‘,’ token
wanconfig.c:860: error: expected identifier or ‘(’ before ‘,’ token
wanconfig.c:861: error: expected identifier or ‘(’ before ‘,’ token
wanconfig.c:862: error: expected identifier or ‘(’ before ‘,’ token
wanconfig.c:865: error: expected identifier or ‘(’ before ‘,’ token
wanconfig.c:867: error: expected identifier or ‘(’ before ‘}’ token
wanconfig.c:872: error: expected specifier-qualifier-list before ‘wan_bitstrm_conf_if_t’
wanconfig.c:872: error: initializer element is not constant
wanconfig.c:872: error: (near initialization for ‘bitstrm_if_conftab[0].offset’)
wanconfig.c:872: error: expected ‘}’ before ‘)’ token
wanconfig.c:872: error: expected ‘,’ or ‘;’ before ‘)’ token
wanconfig.c:872: error: expected identifier or ‘(’ before ‘,’ token
wanconfig.c:873: error: expected identifier or ‘(’ before ‘,’ token
wanconfig.c:874: error: expected identifier or ‘(’ before ‘,’ token
wanconfig.c:876: error: expected identifier or ‘(’ before ‘}’ token
wanconfig.c:881: error: expected specifier-qualifier-list before ‘wan_adsl_conf_t’
wanconfig.c:881: error: initializer element is not constant
wanconfig.c:881: error: (near initialization for ‘adsl_conftab[0].offset’)
wanconfig.c:881: error: expected ‘}’ before ‘)’ token
wanconfig.c:881: error: expected ‘,’ or ‘;’ before ‘)’ token
wanconfig.c:881: error: expected identifier or ‘(’ before ‘,’ token
wanconfig.c:883: error: expected identifier or ‘(’ before ‘,’ token
wanconfig.c:884: error: expected identifier or ‘(’ before ‘,’ token
wanconfig.c:886: error: expected identifier or ‘(’ before ‘,’ token
wanconfig.c:888: error: expected identifier or ‘(’ before ‘,’ token
wanconfig.c:889: error: expected identifier or ‘(’ before ‘,’ token
wanconfig.c:891: error: expected identifier or ‘(’ before ‘,’ token
wanconfig.c:893: error: expected identifier or ‘(’ before ‘,’ token
wanconfig.c:894: error: expected identifier or ‘(’ before ‘,’ token
wanconfig.c:896: error: expected identifier or ‘(’ before ‘,’ token
wanconfig.c:898: error: expected identifier or ‘(’ before ‘,’ token
wanconfig.c:900: error: expected identifier or ‘(’ before ‘,’ token
wanconfig.c:901: error: expected identifier or ‘(’ before ‘,’ token
wanconfig.c:903: error: expected identifier or ‘(’ before ‘,’ token
wanconfig.c:904: error: expected identifier or ‘(’ before ‘,’ token
wanconfig.c:905: error: expected identifier or ‘(’ before ‘,’ token
wanconfig.c:906: error: expected identifier or ‘(’ before ‘,’ token
wanconfig.c:907: error: expected identifier or ‘(’ before ‘,’ token
wanconfig.c:908: error: expected identifier or ‘(’ before ‘,’ token
wanconfig.c:909: error: expected identifier or ‘(’ before ‘,’ token
wanconfig.c:910: error: expected identifier or ‘(’ before ‘,’ token
wanconfig.c:911: error: expected identifier or ‘(’ before ‘,’ token
wanconfig.c:912: error: expected identifier or ‘(’ before ‘,’ token
wanconfig.c:913: error: expected identifier or ‘(’ before ‘,’ token
wanconfig.c:914: error: expected identifier or ‘(’ before ‘,’ token
wanconfig.c:915: error: expected identifier or ‘(’ before ‘,’ token
wanconfig.c:916: error: expected identifier or ‘(’ before ‘,’ token
wanconfig.c:919: error: expected identifier or ‘(’ before ‘,’ token
wanconfig.c:920: error: expected identifier or ‘(’ before ‘,’ token
wanconfig.c:921: error: expected identifier or ‘(’ before ‘,’ token
wanconfig.c:922: error: expected identifier or ‘(’ before ‘,’ token
wanconfig.c:923: error: expected identifier or ‘(’ before ‘,’ token
wanconfig.c:924: error: expected identifier or ‘(’ before ‘,’ token
wanconfig.c:925: error: expected identifier or ‘(’ before ‘,’ token
wanconfig.c:926: error: expected identifier or ‘(’ before ‘,’ token
wanconfig.c:927: error: expected identifier or ‘(’ before ‘,’ token
wanconfig.c:928: error: expected identifier or ‘(’ before ‘,’ token
wanconfig.c:929: error: expected identifier or ‘(’ before ‘,’ token
wanconfig.c:930: error: expected identifier or ‘(’ before ‘,’ token
wanconfig.c:931: error: expected identifier or ‘(’ before ‘,’ token
wanconfig.c:932: error: expected identifier or ‘(’ before ‘,’ token
wanconfig.c:934: error: expected identifier or ‘(’ before ‘,’ token
wanconfig.c:935: error: expected identifier or ‘(’ before ‘,’ token
wanconfig.c:937: error: expected identifier or ‘(’ before ‘}’ token
wanconfig.c:941: error: expected specifier-qualifier-list before ‘wan_bscstrm_conf_t’
wanconfig.c:941: error: initializer element is not constant
wanconfig.c:941: error: (near initialization for ‘bscstrm_conftab[0].offset’)
wanconfig.c:941: error: expected ‘}’ before ‘)’ token
wanconfig.c:941: error: expected ‘,’ or ‘;’ before ‘)’ token
wanconfig.c:941: error: expected identifier or ‘(’ before ‘,’ token
wanconfig.c:942: error: expected identifier or ‘(’ before ‘,’ token
wanconfig.c:943: error: expected identifier or ‘(’ before ‘,’ token
wanconfig.c:944: error: expected identifier or ‘(’ before ‘,’ token
wanconfig.c:945: error: expected identifier or ‘(’ before ‘,’ token
wanconfig.c:946: error: expected identifier or ‘(’ before ‘,’ token
wanconfig.c:947: error: expected identifier or ‘(’ before ‘,’ token
wanconfig.c:948: error: expected identifier or ‘(’ before ‘,’ token
wanconfig.c:949: error: expected identifier or ‘(’ before ‘,’ token
wanconfig.c:950: error: expected identifier or ‘(’ before ‘,’ token
wanconfig.c:951: error: expected identifier or ‘(’ before ‘,’ token
wanconfig.c:953: error: expected identifier or ‘(’ before ‘}’ token
wanconfig.c:958: error: expected specifier-qualifier-list before ‘wan_ss7_conf_t’
wanconfig.c:958: error: initializer element is not constant
wanconfig.c:958: error: (near initialization for ‘ss7_conftab[0].offset’)
wanconfig.c:958: error: expected ‘}’ before ‘)’ token
wanconfig.c:958: error: expected ‘,’ or ‘;’ before ‘)’ token
wanconfig.c:958: error: expected identifier or ‘(’ before ‘,’ token
wanconfig.c:959: error: expected identifier or ‘(’ before ‘,’ token
wanconfig.c:960: error: expected identifier or ‘(’ before ‘,’ token
wanconfig.c:961: error: expected identifier or ‘(’ before ‘,’ token
wanconfig.c:962: error: expected identifier or ‘(’ before ‘,’ token
wanconfig.c:963: error: expected identifier or ‘(’ before ‘,’ token
wanconfig.c:964: error: expected identifier or ‘(’ before ‘,’ token
wanconfig.c:965: error: expected identifier or ‘(’ before ‘,’ token
wanconfig.c:966: error: expected identifier or ‘(’ before ‘,’ token
wanconfig.c:967: error: expected identifier or ‘(’ before ‘,’ token
wanconfig.c:968: error: expected identifier or ‘(’ before ‘,’ token
wanconfig.c:969: error: expected identifier or ‘(’ before ‘,’ token
wanconfig.c:970: error: expected identifier or ‘(’ before ‘,’ token
wanconfig.c:971: error: expected identifier or ‘(’ before ‘,’ token
wanconfig.c:972: error: expected identifier or ‘(’ before ‘,’ token
wanconfig.c:973: error: expected identifier or ‘(’ before ‘,’ token
wanconfig.c:974: error: expected identifier or ‘(’ before ‘,’ token
wanconfig.c:975: error: expected identifier or ‘(’ before ‘,’ token
wanconfig.c:976: error: expected identifier or ‘(’ before ‘,’ token
wanconfig.c:977: error: expected identifier or ‘(’ before ‘,’ token
wanconfig.c:978: error: expected identifier or ‘(’ before ‘,’ token
wanconfig.c:979: error: expected identifier or ‘(’ before ‘,’ token
wanconfig.c:980: error: expected identifier or ‘(’ before ‘,’ token
wanconfig.c:981: error: expected identifier or ‘(’ before ‘,’ token
wanconfig.c:982: error: expected identifier or ‘(’ before ‘,’ token
wanconfig.c:983: error: expected identifier or ‘(’ before ‘,’ token
wanconfig.c:984: error: expected identifier or ‘(’ before ‘,’ token
wanconfig.c:985: error: expected identifier or ‘(’ before ‘,’ token
wanconfig.c:986: error: expected identifier or ‘(’ before ‘,’ token
wanconfig.c:987: error: expected identifier or ‘(’ before ‘,’ token
wanconfig.c:989: error: expected identifier or ‘(’ before ‘}’ token
wanconfig.c:995: error: expected specifier-qualifier-list before ‘wan_x25_conf_t’
wanconfig.c:995: error: initializer element is not constant
wanconfig.c:995: error: (near initialization for ‘x25_conftab[0].offset’)
wanconfig.c:995: error: expected ‘}’ before ‘)’ token
wanconfig.c:995: error: expected ‘,’ or ‘;’ before ‘)’ token
wanconfig.c:995: error: expected identifier or ‘(’ before ‘,’ token
wanconfig.c:996: error: expected identifier or ‘(’ before ‘,’ token
wanconfig.c:997: error: expected identifier or ‘(’ before ‘,’ token
wanconfig.c:998: error: expected identifier or ‘(’ before ‘,’ token
wanconfig.c:999: error: expected identifier or ‘(’ before ‘,’ token
wanconfig.c:1000: error: expected identifier or ‘(’ before ‘,’ token
wanconfig.c:1001: error: expected identifier or ‘(’ before ‘,’ token
wanconfig.c:1002: error: expected identifier or ‘(’ before ‘,’ token
wanconfig.c:1003: error: expected identifier or ‘(’ before ‘,’ token
wanconfig.c:1004: error: expected identifier or ‘(’ before ‘,’ token
wanconfig.c:1005: error: expected identifier or ‘(’ before ‘,’ token
wanconfig.c:1006: error: expected identifier or ‘(’ before ‘,’ token
wanconfig.c:1007: error: expected identifier or ‘(’ before ‘,’ token
wanconfig.c:1008: error: expected identifier or ‘(’ before ‘,’ token
wanconfig.c:1009: error: expected identifier or ‘(’ before ‘,’ token
wanconfig.c:1010: error: expected identifier or ‘(’ before ‘,’ token
wanconfig.c:1011: error: expected identifier or ‘(’ before ‘,’ token
wanconfig.c:1012: error: expected identifier or ‘(’ before ‘,’ token
wanconfig.c:1013: error: expected identifier or ‘(’ before ‘,’ token
wanconfig.c:1014: error: expected identifier or ‘(’ before ‘,’ token
wanconfig.c:1015: error: expected identifier or ‘(’ before ‘,’ token
wanconfig.c:1016: error: expected identifier or ‘(’ before ‘,’ token
wanconfig.c:1017: error: expected identifier or ‘(’ before ‘,’ token
wanconfig.c:1018: error: expected identifier or ‘(’ before ‘,’ token
wanconfig.c:1019: error: expected identifier or ‘(’ before ‘,’ token
wanconfig.c:1020: error: expected identifier or ‘(’ before ‘,’ token
wanconfig.c:1021: error: expected identifier or ‘(’ before ‘,’ token
wanconfig.c:1022: error: expected identifier or ‘(’ before ‘,’ token
wanconfig.c:1024: error: expected identifier or ‘(’ before ‘}’ token
wanconfig.c:1029: error: expected specifier-qualifier-list before ‘wan_lapb_if_conf_t’
wanconfig.c:1029: error: initializer element is not constant
wanconfig.c:1029: error: (near initialization for ‘lapb_annexg_conftab[0].offset’)
wanconfig.c:1029: error: expected ‘}’ before ‘)’ token
wanconfig.c:1029: error: expected ‘,’ or ‘;’ before ‘)’ token
wanconfig.c:1029: error: expected identifier or ‘(’ before ‘,’ token
wanconfig.c:1030: error: expected identifier or ‘(’ before ‘,’ token
wanconfig.c:1031: error: expected identifier or ‘(’ before ‘,’ token
wanconfig.c:1032: error: expected identifier or ‘(’ before ‘,’ token
wanconfig.c:1033: error: expected identifier or ‘(’ before ‘,’ token
wanconfig.c:1034: error: expected identifier or ‘(’ before ‘,’ token
wanconfig.c:1035: error: expected identifier or ‘(’ before ‘,’ token
wanconfig.c:1036: error: expected identifier or ‘(’ before ‘,’ token
wanconfig.c:1037: error: expected identifier or ‘(’ before ‘,’ token
wanconfig.c:1038: error: expected identifier or ‘(’ before ‘,’ token
wanconfig.c:1039: error: expected identifier or ‘(’ before ‘,’ token
wanconfig.c:1040: error: expected identifier or ‘(’ before ‘,’ token
wanconfig.c:1042: error: expected identifier or ‘(’ before ‘,’ token
wanconfig.c:1043: error: expected identifier or ‘(’ before ‘,’ token
wanconfig.c:1044: error: expected identifier or ‘(’ before ‘,’ token
wanconfig.c:1046: error: expected identifier or ‘(’ before ‘,’ token
wanconfig.c:1049: error: expected identifier or ‘(’ before ‘}’ token
wanconfig.c:1054: error: expected specifier-qualifier-list before ‘wan_x25_if_conf_t’
wanconfig.c:1054: error: initializer element is not constant
wanconfig.c:1054: error: (near initialization for ‘x25_annexg_conftab[0].offset’)
wanconfig.c:1054: error: expected ‘}’ before ‘)’ token
wanconfig.c:1054: error: expected ‘,’ or ‘;’ before ‘)’ token
wanconfig.c:1054: error: expected identifier or ‘(’ before ‘,’ token
wanconfig.c:1055: error: expected identifier or ‘(’ before ‘,’ token
wanconfig.c:1056: error: expected identifier or ‘(’ before ‘,’ token
wanconfig.c:1057: error: expected identifier or ‘(’ before ‘,’ token
wanconfig.c:1058: error: expected identifier or ‘(’ before ‘,’ token
wanconfig.c:1059: error: expected identifier or ‘(’ before ‘,’ token
wanconfig.c:1060: error: expected identifier or ‘(’ before ‘,’ token
wanconfig.c:1061: error: expected identifier or ‘(’ before ‘,’ token
wanconfig.c:1062: error: expected identifier or ‘(’ before ‘,’ token
wanconfig.c:1063: error: expected identifier or ‘(’ before ‘,’ token
wanconfig.c:1064: error: expected identifier or ‘(’ before ‘,’ token
wanconfig.c:1066: error: expected identifier or ‘(’ before ‘,’ token
wanconfig.c:1067: error: expected identifier or ‘(’ before ‘,’ token
wanconfig.c:1068: error: expected identifier or ‘(’ before ‘,’ token
wanconfig.c:1069: error: expected identifier or ‘(’ before ‘,’ token
wanconfig.c:1071: error: expected identifier or ‘(’ before ‘,’ token
wanconfig.c:1072: error: expected identifier or ‘(’ before ‘,’ token
wanconfig.c:1073: error: expected identifier or ‘(’ before ‘,’ token
wanconfig.c:1074: error: expected identifier or ‘(’ before ‘,’ token
wanconfig.c:1076: error: expected identifier or ‘(’ before ‘,’ token
wanconfig.c:1077: error: expected identifier or ‘(’ before ‘,’ token
wanconfig.c:1079: error: expected identifier or ‘(’ before ‘,’ token
wanconfig.c:1080: error: expected identifier or ‘(’ before ‘,’ token
wanconfig.c:1082: error: expected identifier or ‘(’ before ‘,’ token
wanconfig.c:1083: error: expected identifier or ‘(’ before ‘,’ token
wanconfig.c:1085: error: expected identifier or ‘(’ before ‘,’ token
wanconfig.c:1086: error: expected identifier or ‘(’ before ‘,’ token
wanconfig.c:1087: error: expected identifier or ‘(’ before ‘,’ token
wanconfig.c:1089: error: expected identifier or ‘(’ before ‘,’ token
wanconfig.c:1090: error: expected identifier or ‘(’ before ‘,’ token
wanconfig.c:1091: error: expected identifier or ‘(’ before ‘,’ token
wanconfig.c:1092: error: expected identifier or ‘(’ before ‘,’ token
wanconfig.c:1093: error: expected identifier or ‘(’ before ‘,’ token
wanconfig.c:1095: error: expected identifier or ‘(’ before ‘,’ token
wanconfig.c:1096: error: expected identifier or ‘(’ before ‘,’ token
wanconfig.c:1097: error: expected identifier or ‘(’ before ‘,’ token
wanconfig.c:1100: error: expected identifier or ‘(’ before ‘}’ token
wanconfig.c:1105: error: expected specifier-qualifier-list before ‘wan_dsp_if_conf_t’
wanconfig.c:1105: error: initializer element is not constant
wanconfig.c:1105: error: (near initialization for ‘dsp_annexg_conftab[0].offset’)
wanconfig.c:1105: error: expected ‘}’ before ‘)’ token
wanconfig.c:1105: error: expected ‘,’ or ‘;’ before ‘)’ token
wanconfig.c:1105: error: expected identifier or ‘(’ before ‘,’ token
wanconfig.c:1106: error: expected identifier or ‘(’ before ‘,’ token
wanconfig.c:1107: error: expected identifier or ‘(’ before ‘,’ token
wanconfig.c:1108: error: expected identifier or ‘(’ before ‘,’ token
wanconfig.c:1109: error: expected identifier or ‘(’ before ‘,’ token
wanconfig.c:1110: error: expected identifier or ‘(’ before ‘,’ token
wanconfig.c:1111: error: expected identifier or ‘(’ before ‘,’ token
wanconfig.c:1112: error: expected identifier or ‘(’ before ‘,’ token
wanconfig.c:1114: error: expected identifier or ‘(’ before ‘}’ token
wanconfig.c:1118: error: expected specifier-qualifier-list before ‘wanif_conf_t’
wanconfig.c:1118: error: initializer element is not constant
wanconfig.c:1118: error: (near initialization for ‘chan_conftab[0].offset’)
wanconfig.c:1118: error: expected ‘}’ before ‘)’ token
wanconfig.c:1118: error: expected ‘,’ or ‘;’ before ‘)’ token
wanconfig.c:1118: error: expected identifier or ‘(’ before ‘,’ token
wanconfig.c:1119: error: expected identifier or ‘(’ before ‘,’ token
wanconfig.c:1120: error: expected identifier or ‘(’ before ‘,’ token
wanconfig.c:1121: error: expected identifier or ‘(’ before ‘,’ token
wanconfig.c:1122: error: expected identifier or ‘(’ before ‘,’ token
wanconfig.c:1123: error: expected identifier or ‘(’ before ‘,’ token
wanconfig.c:1124: error: expected identifier or ‘(’ before ‘,’ token
wanconfig.c:1125: error: expected identifier or ‘(’ before ‘,’ token
wanconfig.c:1126: error: expected identifier or ‘(’ before ‘,’ token
wanconfig.c:1127: error: expected identifier or ‘(’ before ‘,’ token
wanconfig.c:1128: error: expected identifier or ‘(’ before ‘,’ token
wanconfig.c:1129: error: expected identifier or ‘(’ before ‘,’ token
wanconfig.c:1130: error: expected identifier or ‘(’ before ‘,’ token
wanconfig.c:1131: error: expected identifier or ‘(’ before ‘,’ token
wanconfig.c:1132: error: expected identifier or ‘(’ before ‘,’ token
wanconfig.c:1133: error: expected identifier or ‘(’ before ‘,’ token
wanconfig.c:1134: error: expected identifier or ‘(’ before ‘,’ token
wanconfig.c:1135: error: expected identifier or ‘(’ before ‘,’ token
wanconfig.c:1136: error: expected identifier or ‘(’ before ‘,’ token
wanconfig.c:1137: error: expected identifier or ‘(’ before ‘,’ token
wanconfig.c:1138: error: expected identifier or ‘(’ before ‘,’ token
wanconfig.c:1139: error: expected identifier or ‘(’ before ‘,’ token
wanconfig.c:1140: error: expected identifier or ‘(’ before ‘,’ token
wanconfig.c:1141: error: expected identifier or ‘(’ before ‘,’ token
wanconfig.c:1143: error: expected identifier or ‘(’ before ‘,’ token
wanconfig.c:1144: error: expected identifier or ‘(’ before ‘,’ token
wanconfig.c:1145: error: expected identifier or ‘(’ before ‘,’ token
wanconfig.c:1146: error: expected identifier or ‘(’ before ‘,’ token
wanconfig.c:1148: error: expected identifier or ‘(’ before ‘,’ token
wanconfig.c:1154: error: expected identifier or ‘(’ before ‘,’ token
wanconfig.c:1155: error: expected identifier or ‘(’ before ‘,’ token
wanconfig.c:1156: error: expected identifier or ‘(’ before ‘,’ token
wanconfig.c:1157: error: expected identifier or ‘(’ before ‘,’ token
wanconfig.c:1160: error: expected identifier or ‘(’ before ‘,’ token
wanconfig.c:1161: error: expected identifier or ‘(’ before ‘,’ token
wanconfig.c:1162: error: expected identifier or ‘(’ before ‘,’ token
wanconfig.c:1163: error: expected identifier or ‘(’ before ‘,’ token
wanconfig.c:1164: error: expected identifier or ‘(’ before ‘,’ token
wanconfig.c:1165: error: expected identifier or ‘(’ before ‘,’ token
wanconfig.c:1166: error: expected identifier or ‘(’ before ‘,’ token
wanconfig.c:1167: error: expected identifier or ‘(’ before ‘,’ token
wanconfig.c:1168: error: expected identifier or ‘(’ before ‘,’ token
wanconfig.c:1169: error: expected identifier or ‘(’ before ‘,’ token
wanconfig.c:1170: error: expected identifier or ‘(’ before ‘,’ token
wanconfig.c:1171: error: expected identifier or ‘(’ before ‘,’ token
wanconfig.c:1172: error: expected identifier or ‘(’ before ‘,’ token
wanconfig.c:1173: error: expected identifier or ‘(’ before ‘,’ token
wanconfig.c:1174: error: expected identifier or ‘(’ before ‘,’ token
wanconfig.c:1175: error: expected identifier or ‘(’ before ‘,’ token
wanconfig.c:1176: error: expected identifier or ‘(’ before ‘,’ token
wanconfig.c:1177: error: expected identifier or ‘(’ before ‘,’ token
wanconfig.c:1178: error: expected identifier or ‘(’ before ‘,’ token
wanconfig.c:1179: error: expected identifier or ‘(’ before ‘,’ token
wanconfig.c:1181: error: expected identifier or ‘(’ before ‘,’ token
wanconfig.c:1183: error: expected identifier or ‘(’ before ‘,’ token
wanconfig.c:1184: error: expected identifier or ‘(’ before ‘,’ token
wanconfig.c:1186: error: expected identifier or ‘(’ before ‘,’ token
wanconfig.c:1187: error: expected identifier or ‘(’ before ‘,’ token
wanconfig.c:1188: error: expected identifier or ‘(’ before ‘,’ token
wanconfig.c:1192: error: expected identifier or ‘(’ before ‘,’ token
wanconfig.c:1195: error: expected identifier or ‘(’ before ‘}’ token
wanconfig.c:1199: error: ‘WANCONFIG_PPP’ undeclared here (not in a function)
wanconfig.c:1199: error: initializer element is not constant
wanconfig.c:1199: error: (near initialization for ‘conf_def_tables[0].val’)
wanconfig.c:1200: error: ‘WANCONFIG_FR’ undeclared here (not in a function)
wanconfig.c:1200: error: initializer element is not constant
wanconfig.c:1200: error: (near initialization for ‘conf_def_tables[1].val’)
wanconfig.c:1201: error: ‘WANCONFIG_X25’ undeclared here (not in a function)
wanconfig.c:1201: error: initializer element is not constant
wanconfig.c:1201: error: (near initialization for ‘conf_def_tables[2].val’)
wanconfig.c:1202: error: ‘WANCONFIG_ADCCP’ undeclared here (not in a function)
wanconfig.c:1202: error: initializer element is not constant
wanconfig.c:1202: error: (near initialization for ‘conf_def_tables[3].val’)
wanconfig.c:1203: error: ‘WANCONFIG_CHDLC’ undeclared here (not in a function)
wanconfig.c:1203: error: initializer element is not constant
wanconfig.c:1203: error: (near initialization for ‘conf_def_tables[4].val’)
wanconfig.c:1204: error: ‘WANCONFIG_ASYHDLC’ undeclared here (not in a function)
wanconfig.c:1204: error: initializer element is not constant
wanconfig.c:1204: error: (near initialization for ‘conf_def_tables[5].val’)
wanconfig.c:1205: error: ‘WANCONFIG_MPPP’ undeclared here (not in a function)
wanconfig.c:1205: error: initializer element is not constant
wanconfig.c:1205: error: (near initialization for ‘conf_def_tables[6].val’)
wanconfig.c:1206: error: ‘WANCONFIG_LIP_ATM’ undeclared here (not in a function)
wanconfig.c:1206: error: initializer element is not constant
wanconfig.c:1206: error: (near initialization for ‘conf_def_tables[7].val’)
wanconfig.c:1207: error: ‘WANCONFIG_LIP_KATM’ undeclared here (not in a function)
wanconfig.c:1207: error: initializer element is not constant
wanconfig.c:1207: error: (near initialization for ‘conf_def_tables[8].val’)
wanconfig.c:1208: error: ‘WANCONFIG_MFR’ undeclared here (not in a function)
wanconfig.c:1208: error: initializer element is not constant
wanconfig.c:1208: error: (near initialization for ‘conf_def_tables[9].val’)
wanconfig.c:1209: error: ‘WANCONFIG_SS7’ undeclared here (not in a function)
wanconfig.c:1209: error: initializer element is not constant
wanconfig.c:1209: error: (near initialization for ‘conf_def_tables[10].val’)
wanconfig.c:1210: error: ‘WANCONFIG_ADSL’ undeclared here (not in a function)
wanconfig.c:1210: error: initializer element is not constant
wanconfig.c:1210: error: (near initialization for ‘conf_def_tables[11].val’)
wanconfig.c:1211: error: ‘WANCONFIG_BSCSTRM’ undeclared here (not in a function)
wanconfig.c:1211: error: initializer element is not constant
wanconfig.c:1211: error: (near initialization for ‘conf_def_tables[12].val’)
wanconfig.c:1212: error: ‘WANCONFIG_ATM’ undeclared here (not in a function)
wanconfig.c:1212: error: initializer element is not constant
wanconfig.c:1212: error: (near initialization for ‘conf_def_tables[13].val’)
wanconfig.c:1213: error: ‘WANCONFIG_MLINK_PPP’ undeclared here (not in a function)
wanconfig.c:1213: error: initializer element is not constant
wanconfig.c:1213: error: (near initialization for ‘conf_def_tables[14].val’)
wanconfig.c:1214: error: ‘WANCONFIG_AFT’ undeclared here (not in a function)
wanconfig.c:1214: error: initializer element is not constant
wanconfig.c:1214: error: (near initialization for ‘conf_def_tables[15].val’)
wanconfig.c:1215: error: ‘WANCONFIG_AFT_TE1’ undeclared here (not in a function)
wanconfig.c:1215: error: initializer element is not constant
wanconfig.c:1215: error: (near initialization for ‘conf_def_tables[16].val’)
wanconfig.c:1216: error: ‘WANCONFIG_AFT_ANALOG’ undeclared here (not in a function)
wanconfig.c:1216: error: initializer element is not constant
wanconfig.c:1216: error: (near initialization for ‘conf_def_tables[17].val’)
wanconfig.c:1217: error: ‘WANCONFIG_AFT_TE3’ undeclared here (not in a function)
wanconfig.c:1217: error: initializer element is not constant
wanconfig.c:1217: error: (near initialization for ‘conf_def_tables[18].val’)
wanconfig.c:1218: error: ‘WANCONFIG_AFT_56K’ undeclared here (not in a function)
wanconfig.c:1218: error: initializer element is not constant
wanconfig.c:1218: error: (near initialization for ‘conf_def_tables[19].val’)
wanconfig.c:1219: error: ‘WANCONFIG_BITSTRM’ undeclared here (not in a function)
wanconfig.c:1219: error: initializer element is not constant
wanconfig.c:1219: error: (near initialization for ‘conf_def_tables[20].val’)
wanconfig.c:1220: error: ‘WANCONFIG_SDLC’ undeclared here (not in a function)
wanconfig.c:1220: error: initializer element is not constant
wanconfig.c:1220: error: (near initialization for ‘conf_def_tables[21].val’)
wanconfig.c:1226: error: initializer element is not constant
wanconfig.c:1226: error: (near initialization for ‘conf_if_def_tables[0].val’)
wanconfig.c:1227: error: initializer element is not constant
wanconfig.c:1227: error: (near initialization for ‘conf_if_def_tables[1].val’)
wanconfig.c:1228: error: initializer element is not constant
wanconfig.c:1228: error: (near initialization for ‘conf_if_def_tables[2].val’)
wanconfig.c:1229: error: initializer element is not constant
wanconfig.c:1229: error: (near initialization for ‘conf_if_def_tables[3].val’)
wanconfig.c:1230: error: initializer element is not constant
wanconfig.c:1230: error: (near initialization for ‘conf_if_def_tables[4].val’)
wanconfig.c:1231: error: initializer element is not constant
wanconfig.c:1231: error: (near initialization for ‘conf_if_def_tables[5].val’)
wanconfig.c:1232: error: initializer element is not constant
wanconfig.c:1232: error: (near initialization for ‘conf_if_def_tables[6].val’)
wanconfig.c:1233: error: initializer element is not constant
wanconfig.c:1233: error: (near initialization for ‘conf_if_def_tables[7].val’)
wanconfig.c:1234: error: initializer element is not constant
wanconfig.c:1234: error: (near initialization for ‘conf_if_def_tables[8].val’)
wanconfig.c:1235: error: initializer element is not constant
wanconfig.c:1235: error: (near initialization for ‘conf_if_def_tables[9].val’)
wanconfig.c:1260: error: initializer element is not constant
wanconfig.c:1260: error: (near initialization for ‘config_id_str[0].val’)
wanconfig.c:1261: error: initializer element is not constant
wanconfig.c:1261: error: (near initialization for ‘config_id_str[1].val’)
wanconfig.c:1262: error: initializer element is not constant
wanconfig.c:1262: error: (near initialization for ‘config_id_str[2].val’)
wanconfig.c:1263: error: initializer element is not constant
wanconfig.c:1263: error: (near initialization for ‘config_id_str[3].val’)
wanconfig.c:1264: error: initializer element is not constant
wanconfig.c:1264: error: (near initialization for ‘config_id_str[4].val’)
wanconfig.c:1265: error: ‘WANCONFIG_BSC’ undeclared here (not in a function)
wanconfig.c:1265: error: initializer element is not constant
wanconfig.c:1265: error: (near initialization for ‘config_id_str[5].val’)
wanconfig.c:1266: error: ‘WANCONFIG_HDLC’ undeclared here (not in a function)
wanconfig.c:1266: error: initializer element is not constant
wanconfig.c:1266: error: (near initialization for ‘config_id_str[6].val’)
wanconfig.c:1267: error: initializer element is not constant
wanconfig.c:1267: error: (near initialization for ‘config_id_str[7].val’)
wanconfig.c:1268: error: ‘WANCONFIG_MPROT’ undeclared here (not in a function)
wanconfig.c:1268: error: initializer element is not constant
wanconfig.c:1268: error: (near initialization for ‘config_id_str[8].val’)
wanconfig.c:1269: error: initializer element is not constant
wanconfig.c:1269: error: (near initialization for ‘config_id_str[9].val’)
wanconfig.c:1270: error: initializer element is not constant
wanconfig.c:1270: error: (near initialization for ‘config_id_str[10].val’)
wanconfig.c:1271: error: initializer element is not constant
wanconfig.c:1271: error: (near initialization for ‘config_id_str[11].val’)
wanconfig.c:1272: error: ‘WANCONFIG_EDUKIT’ undeclared here (not in a function)
wanconfig.c:1272: error: initializer element is not constant
wanconfig.c:1272: error: (near initialization for ‘config_id_str[12].val’)
wanconfig.c:1273: error: initializer element is not constant
wanconfig.c:1273: error: (near initialization for ‘config_id_str[13].val’)
wanconfig.c:1274: error: initializer element is not constant
wanconfig.c:1274: error: (near initialization for ‘config_id_str[14].val’)
wanconfig.c:1275: error: initializer element is not constant
wanconfig.c:1275: error: (near initialization for ‘config_id_str[15].val’)
wanconfig.c:1276: error: initializer element is not constant
wanconfig.c:1276: error: (near initialization for ‘config_id_str[16].val’)
wanconfig.c:1277: error: initializer element is not constant
wanconfig.c:1277: error: (near initialization for ‘config_id_str[17].val’)
wanconfig.c:1278: error: initializer element is not constant
wanconfig.c:1278: error: (near initialization for ‘config_id_str[18].val’)
wanconfig.c:1279: error: ‘WANCONFIG_POS’ undeclared here (not in a function)
wanconfig.c:1279: error: initializer element is not constant
wanconfig.c:1279: error: (near initialization for ‘config_id_str[19].val’)
wanconfig.c:1280: error: initializer element is not constant
wanconfig.c:1280: error: (near initialization for ‘config_id_str[20].val’)
wanconfig.c:1281: error: initializer element is not constant
wanconfig.c:1281: error: (near initialization for ‘config_id_str[21].val’)
wanconfig.c:1282: error: initializer element is not constant
wanconfig.c:1282: error: (near initialization for ‘config_id_str[22].val’)
wanconfig.c:1283: error: initializer element is not constant
wanconfig.c:1283: error: (near initialization for ‘config_id_str[23].val’)
wanconfig.c:1284: error: initializer element is not constant
wanconfig.c:1284: error: (near initialization for ‘config_id_str[24].val’)
wanconfig.c:1285: error: initializer element is not constant
wanconfig.c:1285: error: (near initialization for ‘config_id_str[25].val’)
wanconfig.c:1286: error: initializer element is not constant
wanconfig.c:1286: error: (near initialization for ‘config_id_str[26].val’)
wanconfig.c:1287: error: ‘WANCONFIG_DEBUG’ undeclared here (not in a function)
wanconfig.c:1287: error: initializer element is not constant
wanconfig.c:1287: error: (near initialization for ‘config_id_str[27].val’)
wanconfig.c:1288: error: initializer element is not constant
wanconfig.c:1288: error: (near initialization for ‘config_id_str[28].val’)
wanconfig.c:1289: error: initializer element is not constant
wanconfig.c:1289: error: (near initialization for ‘config_id_str[29].val’)
wanconfig.c:1299: error: ‘WANOPT_OFF’ undeclared here (not in a function)
wanconfig.c:1299: error: initializer element is not constant
wanconfig.c:1299: error: (near initialization for ‘sym_table[0].val’)
wanconfig.c:1300: error: ‘WANOPT_ON’ undeclared here (not in a function)
wanconfig.c:1300: error: initializer element is not constant
wanconfig.c:1300: error: (near initialization for ‘sym_table[1].val’)
wanconfig.c:1301: error: ‘WANOPT_NO’ undeclared here (not in a function)
wanconfig.c:1301: error: initializer element is not constant
wanconfig.c:1301: error: (near initialization for ‘sym_table[2].val’)
wanconfig.c:1302: error: ‘WANOPT_YES’ undeclared here (not in a function)
wanconfig.c:1302: error: initializer element is not constant
wanconfig.c:1302: error: (near initialization for ‘sym_table[3].val’)
wanconfig.c:1304: error: ‘WANOPT_RS232’ undeclared here (not in a function)
wanconfig.c:1304: error: initializer element is not constant
wanconfig.c:1304: error: (near initialization for ‘sym_table[4].val’)
wanconfig.c:1305: error: ‘WANOPT_V35’ undeclared here (not in a function)
wanconfig.c:1305: error: initializer element is not constant
wanconfig.c:1305: error: (near initialization for ‘sym_table[5].val’)
wanconfig.c:1307: error: ‘WANOPT_NRZ’ undeclared here (not in a function)
wanconfig.c:1307: error: initializer element is not constant
wanconfig.c:1307: error: (near initialization for ‘sym_table[6].val’)
wanconfig.c:1308: error: ‘WANOPT_NRZI’ undeclared here (not in a function)
wanconfig.c:1308: error: initializer element is not constant
wanconfig.c:1308: error: (near initialization for ‘sym_table[7].val’)
wanconfig.c:1309: error: ‘WANOPT_FM0’ undeclared here (not in a function)
wanconfig.c:1309: error: initializer element is not constant
wanconfig.c:1309: error: (near initialization for ‘sym_table[8].val’)
wanconfig.c:1310: error: ‘WANOPT_FM1’ undeclared here (not in a function)
wanconfig.c:1310: error: initializer element is not constant
wanconfig.c:1310: error: (near initialization for ‘sym_table[9].val’)
wanconfig.c:1313: error: ‘WANOPT_IDLE_FLAG’ undeclared here (not in a function)
wanconfig.c:1313: error: initializer element is not constant
wanconfig.c:1313: error: (near initialization for ‘sym_table[10].val’)
wanconfig.c:1314: error: ‘WANOPT_IDLE_MARK’ undeclared here (not in a function)
wanconfig.c:1314: error: initializer element is not constant
wanconfig.c:1314: error: (near initialization for ‘sym_table[11].val’)
wanconfig.c:1317: error: ‘WANOPT_POINTTOPOINT’ undeclared here (not in a function)
wanconfig.c:1317: error: initializer element is not constant
wanconfig.c:1317: error: (near initialization for ‘sym_table[12].val’)
wanconfig.c:1318: error: ‘WANOPT_MULTIDROP’ undeclared here (not in a function)
wanconfig.c:1318: error: initializer element is not constant
wanconfig.c:1318: error: (near initialization for ‘sym_table[13].val’)
wanconfig.c:1320: error: ‘WANOPT_EXTERNAL’ undeclared here (not in a function)
wanconfig.c:1320: error: initializer element is not constant
wanconfig.c:1320: error: (near initialization for ‘sym_table[14].val’)
wanconfig.c:1321: error: ‘WANOPT_INTERNAL’ undeclared here (not in a function)
wanconfig.c:1321: error: initializer element is not constant
wanconfig.c:1321: error: (near initialization for ‘sym_table[15].val’)
wanconfig.c:1323: error: ‘WANOPT_DTE’ undeclared here (not in a function)
wanconfig.c:1323: error: initializer element is not constant
wanconfig.c:1323: error: (near initialization for ‘sym_table[16].val’)
wanconfig.c:1324: error: ‘WANOPT_DCE’ undeclared here (not in a function)
wanconfig.c:1324: error: initializer element is not constant
wanconfig.c:1324: error: (near initialization for ‘sym_table[17].val’)
wanconfig.c:1325: error: ‘WANOPT_CPE’ undeclared here (not in a function)
wanconfig.c:1325: error: initializer element is not constant
wanconfig.c:1325: error: (near initialization for ‘sym_table[18].val’)
wanconfig.c:1326: error: ‘WANOPT_NODE’ undeclared here (not in a function)
wanconfig.c:1326: error: initializer element is not constant
wanconfig.c:1326: error: (near initialization for ‘sym_table[19].val’)
wanconfig.c:1327: error: ‘WANOPT_SECONDARY’ undeclared here (not in a function)
wanconfig.c:1327: error: initializer element is not constant
wanconfig.c:1327: error: (near initialization for ‘sym_table[20].val’)
wanconfig.c:1328: error: ‘WANOPT_PRIMARY’ undeclared here (not in a function)
wanconfig.c:1328: error: initializer element is not constant
wanconfig.c:1328: error: (near initialization for ‘sym_table[21].val’)
wanconfig.c:1330: error: ‘WANOPT_PERMANENT’ undeclared here (not in a function)
wanconfig.c:1330: error: initializer element is not constant
wanconfig.c:1330: error: (near initialization for ‘sym_table[22].val’)
wanconfig.c:1331: error: ‘WANOPT_SWITCHED’ undeclared here (not in a function)
wanconfig.c:1331: error: initializer element is not constant
wanconfig.c:1331: error: (near initialization for ‘sym_table[23].val’)
wanconfig.c:1332: error: ‘WANOPT_ONDEMAND’ undeclared here (not in a function)
wanconfig.c:1332: error: initializer element is not constant
wanconfig.c:1332: error: (near initialization for ‘sym_table[24].val’)
wanconfig.c:1334: error: ‘WANOPT_FR_ANSI’ undeclared here (not in a function)
wanconfig.c:1334: error: initializer element is not constant
wanconfig.c:1334: error: (near initialization for ‘sym_table[25].val’)
wanconfig.c:1335: error: ‘WANOPT_FR_Q933’ undeclared here (not in a function)
wanconfig.c:1335: error: initializer element is not constant
wanconfig.c:1335: error: (near initialization for ‘sym_table[26].val’)
wanconfig.c:1336: error: ‘WANOPT_FR_LMI’ undeclared here (not in a function)
wanconfig.c:1336: error: initializer element is not constant
wanconfig.c:1336: error: (near initialization for ‘sym_table[27].val’)
wanconfig.c:1337: error: ‘WANOPT_FR_NO_LMI’ undeclared here (not in a function)
wanconfig.c:1337: error: initializer element is not constant
wanconfig.c:1337: error: (near initialization for ‘sym_table[28].val’)
wanconfig.c:1339: error: ‘WANOPT_PPP_STATIC’ undeclared here (not in a function)
wanconfig.c:1339: error: initializer element is not constant
wanconfig.c:1339: error: (near initialization for ‘sym_table[29].val’)
wanconfig.c:1340: error: ‘WANOPT_PPP_HOST’ undeclared here (not in a function)
wanconfig.c:1340: error: initializer element is not constant
wanconfig.c:1340: error: (near initialization for ‘sym_table[30].val’)
wanconfig.c:1341: error: ‘WANOPT_PPP_PEER’ undeclared here (not in a function)
wanconfig.c:1341: error: initializer element is not constant
wanconfig.c:1341: error: (near initialization for ‘sym_table[31].val’)
wanconfig.c:1347: error: ‘WANOPT_PRI’ undeclared here (not in a function)
wanconfig.c:1347: error: initializer element is not constant
wanconfig.c:1347: error: (near initialization for ‘sym_table[32].val’)
wanconfig.c:1348: error: ‘WANOPT_SEC’ undeclared here (not in a function)
wanconfig.c:1348: error: initializer element is not constant
wanconfig.c:1348: error: (near initialization for ‘sym_table[33].val’)
wanconfig.c:1351: error: ‘WANOPT_INTR’ undeclared here (not in a function)
wanconfig.c:1351: error: initializer element is not constant
wanconfig.c:1351: error: (near initialization for ‘sym_table[34].val’)
wanconfig.c:1352: error: ‘WANOPT_POLL’ undeclared here (not in a function)
wanconfig.c:1352: error: initializer element is not constant
wanconfig.c:1352: error: (near initialization for ‘sym_table[35].val’)
wanconfig.c:1354: error: ‘WANOPT_ONE’ undeclared here (not in a function)
wanconfig.c:1354: error: initializer element is not constant
wanconfig.c:1354: error: (near initialization for ‘sym_table[36].val’)
wanconfig.c:1355: error: ‘WANOPT_TWO’ undeclared here (not in a function)
wanconfig.c:1355: error: initializer element is not constant
wanconfig.c:1355: error: (near initialization for ‘sym_table[37].val’)
wanconfig.c:1356: error: ‘WANOPT_ONE_AND_HALF’ undeclared here (not in a function)
wanconfig.c:1356: error: initializer element is not constant
wanconfig.c:1356: error: (near initialization for ‘sym_table[38].val’)
wanconfig.c:1357: error: ‘WANOPT_NONE’ undeclared here (not in a function)
wanconfig.c:1357: error: initializer element is not constant
wanconfig.c:1357: error: (near initialization for ‘sym_table[39].val’)
wanconfig.c:1358: error: ‘WANOPT_EVEN’ undeclared here (not in a function)
wanconfig.c:1358: error: initializer element is not constant
wanconfig.c:1358: error: (near initialization for ‘sym_table[40].val’)
wanconfig.c:1359: error: ‘WANOPT_ODD’ undeclared here (not in a function)
wanconfig.c:1359: error: initializer element is not constant
wanconfig.c:1359: error: (near initialization for ‘sym_table[41].val’)
wanconfig.c:1361: error: ‘WANOPT_TTY_SYNC’ undeclared here (not in a function)
wanconfig.c:1361: error: initializer element is not constant
wanconfig.c:1361: error: (near initialization for ‘sym_table[42].val’)
wanconfig.c:1362: error: ‘WANOPT_TTY_ASYNC’ undeclared here (not in a function)
wanconfig.c:1362: error: initializer element is not constant
wanconfig.c:1362: error: (near initialization for ‘sym_table[43].val’)
wanconfig.c:1365: error: ‘WANOPT_FR_EEK_REQUEST’ undeclared here (not in a function)
wanconfig.c:1365: error: initializer element is not constant
wanconfig.c:1365: error: (near initialization for ‘sym_table[44].val’)
wanconfig.c:1366: error: ‘WANOPT_FR_EEK_REPLY’ undeclared here (not in a function)
wanconfig.c:1366: error: initializer element is not constant
wanconfig.c:1366: error: (near initialization for ‘sym_table[45].val’)
wanconfig.c:1372: error: ‘WAN_MEDIA_T1’ undeclared here (not in a function)
wanconfig.c:1372: error: initializer element is not constant
wanconfig.c:1372: error: (near initialization for ‘sym_table[46].val’)
wanconfig.c:1373: error: ‘WAN_MEDIA_E1’ undeclared here (not in a function)
wanconfig.c:1373: error: initializer element is not constant
wanconfig.c:1373: error: (near initialization for ‘sym_table[47].val’)
wanconfig.c:1374: error: ‘WAN_MEDIA_J1’ undeclared here (not in a function)
wanconfig.c:1374: error: initializer element is not constant
wanconfig.c:1374: error: (near initialization for ‘sym_table[48].val’)
wanconfig.c:1375: error: ‘WAN_MEDIA_56K’ undeclared here (not in a function)
wanconfig.c:1375: error: initializer element is not constant
wanconfig.c:1375: error: (near initialization for ‘sym_table[49].val’)
wanconfig.c:1376: error: ‘WAN_MEDIA_DS3’ undeclared here (not in a function)
wanconfig.c:1376: error: initializer element is not constant
wanconfig.c:1376: error: (near initialization for ‘sym_table[50].val’)
wanconfig.c:1377: error: ‘WAN_MEDIA_STS1’ undeclared here (not in a function)
wanconfig.c:1377: error: initializer element is not constant
wanconfig.c:1377: error: (near initialization for ‘sym_table[51].val’)
wanconfig.c:1378: error: ‘WAN_MEDIA_E3’ undeclared here (not in a function)
wanconfig.c:1378: error: initializer element is not constant
wanconfig.c:1378: error: (near initialization for ‘sym_table[52].val’)
wanconfig.c:1379: error: ‘WAN_MEDIA_FXOFXS’ undeclared here (not in a function)
wanconfig.c:1379: error: initializer element is not constant
wanconfig.c:1379: error: (near initialization for ‘sym_table[53].val’)
wanconfig.c:1380: error: ‘WAN_LCODE_AMI’ undeclared here (not in a function)
wanconfig.c:1380: error: initializer element is not constant
wanconfig.c:1380: error: (near initialization for ‘sym_table[54].val’)
wanconfig.c:1381: error: ‘WAN_LCODE_B8ZS’ undeclared here (not in a function)
wanconfig.c:1381: error: initializer element is not constant
wanconfig.c:1381: error: (near initialization for ‘sym_table[55].val’)
wanconfig.c:1382: error: ‘WAN_LCODE_HDB3’ undeclared here (not in a function)
wanconfig.c:1382: error: initializer element is not constant
wanconfig.c:1382: error: (near initialization for ‘sym_table[56].val’)
wanconfig.c:1383: error: ‘WAN_LCODE_B3ZS’ undeclared here (not in a function)
wanconfig.c:1383: error: initializer element is not constant
wanconfig.c:1383: error: (near initialization for ‘sym_table[57].val’)
wanconfig.c:1384: error: ‘WAN_FR_D4’ undeclared here (not in a function)
wanconfig.c:1384: error: initializer element is not constant
wanconfig.c:1384: error: (near initialization for ‘sym_table[58].val’)
wanconfig.c:1385: error: ‘WAN_FR_ESF’ undeclared here (not in a function)
wanconfig.c:1385: error: initializer element is not constant
wanconfig.c:1385: error: (near initialization for ‘sym_table[59].val’)
wanconfig.c:1386: error: ‘WAN_FR_NCRC4’ undeclared here (not in a function)
wanconfig.c:1386: error: initializer element is not constant
wanconfig.c:1386: error: (near initialization for ‘sym_table[60].val’)
wanconfig.c:1387: error: ‘WAN_FR_CRC4’ undeclared here (not in a function)
wanconfig.c:1387: error: initializer element is not constant
wanconfig.c:1387: error: (near initialization for ‘sym_table[61].val’)
wanconfig.c:1388: error: ‘WAN_FR_UNFRAMED’ undeclared here (not in a function)
wanconfig.c:1388: error: initializer element is not constant
wanconfig.c:1388: error: (near initialization for ‘sym_table[62].val’)
wanconfig.c:1389: error: ‘WAN_FR_E3_G751’ undeclared here (not in a function)
wanconfig.c:1389: error: initializer element is not constant
wanconfig.c:1389: error: (near initialization for ‘sym_table[63].val’)
wanconfig.c:1390: error: ‘WAN_FR_E3_G832’ undeclared here (not in a function)
wanconfig.c:1390: error: initializer element is not constant
wanconfig.c:1390: error: (near initialization for ‘sym_table[64].val’)
wanconfig.c:1391: error: ‘WAN_FR_DS3_Cbit’ undeclared here (not in a function)
wanconfig.c:1391: error: initializer element is not constant
wanconfig.c:1391: error: (near initialization for ‘sym_table[65].val’)
wanconfig.c:1392: error: ‘WAN_FR_DS3_M13’ undeclared here (not in a function)
wanconfig.c:1392: error: initializer element is not constant
wanconfig.c:1392: error: (near initialization for ‘sym_table[66].val’)
wanconfig.c:1393: error: ‘WAN_T1_LBO_0_DB’ undeclared here (not in a function)
wanconfig.c:1393: error: initializer element is not constant
wanconfig.c:1393: error: (near initialization for ‘sym_table[67].val’)
wanconfig.c:1394: error: ‘WAN_T1_LBO_75_DB’ undeclared here (not in a function)
wanconfig.c:1394: error: initializer element is not constant
wanconfig.c:1394: error: (near initialization for ‘sym_table[68].val’)
wanconfig.c:1395: error: ‘WAN_T1_LBO_15_DB’ undeclared here (not in a function)
wanconfig.c:1395: error: initializer element is not constant
wanconfig.c:1395: error: (near initialization for ‘sym_table[69].val’)
wanconfig.c:1396: error: ‘WAN_T1_LBO_225_DB’ undeclared here (not in a function)
wanconfig.c:1396: error: initializer element is not constant
wanconfig.c:1396: error: (near initialization for ‘sym_table[70].val’)
wanconfig.c:1397: error: ‘WAN_T1_0_110’ undeclared here (not in a function)
wanconfig.c:1397: error: initializer element is not constant
wanconfig.c:1397: error: (near initialization for ‘sym_table[71].val’)
wanconfig.c:1398: error: ‘WAN_T1_110_220’ undeclared here (not in a function)
wanconfig.c:1398: error: initializer element is not constant
wanconfig.c:1398: error: (near initialization for ‘sym_table[72].val’)
wanconfig.c:1399: error: ‘WAN_T1_220_330’ undeclared here (not in a function)
wanconfig.c:1399: error: initializer element is not constant
wanconfig.c:1399: error: (near initialization for ‘sym_table[73].val’)
wanconfig.c:1400: error: ‘WAN_T1_330_440’ undeclared here (not in a function)
wanconfig.c:1400: error: initializer element is not constant
wanconfig.c:1400: error: (near initialization for ‘sym_table[74].val’)
wanconfig.c:1401: error: ‘WAN_T1_440_550’ undeclared here (not in a function)
wanconfig.c:1401: error: initializer element is not constant
wanconfig.c:1401: error: (near initialization for ‘sym_table[75].val’)
wanconfig.c:1402: error: ‘WAN_T1_550_660’ undeclared here (not in a function)
wanconfig.c:1402: error: initializer element is not constant
wanconfig.c:1402: error: (near initialization for ‘sym_table[76].val’)
wanconfig.c:1403: error: ‘WAN_T1_0_133’ undeclared here (not in a function)
wanconfig.c:1403: error: initializer element is not constant
wanconfig.c:1403: error: (near initialization for ‘sym_table[77].val’)
wanconfig.c:1404: error: ‘WAN_T1_133_266’ undeclared here (not in a function)
wanconfig.c:1404: error: initializer element is not constant
wanconfig.c:1404: error: (near initialization for ‘sym_table[78].val’)
wanconfig.c:1405: error: ‘WAN_T1_266_399’ undeclared here (not in a function)
wanconfig.c:1405: error: initializer element is not constant
wanconfig.c:1405: error: (near initialization for ‘sym_table[79].val’)
wanconfig.c:1406: error: ‘WAN_T1_399_533’ undeclared here (not in a function)
wanconfig.c:1406: error: initializer element is not constant
wanconfig.c:1406: error: (near initialization for ‘sym_table[80].val’)
wanconfig.c:1407: error: ‘WAN_T1_533_655’ undeclared here (not in a function)
wanconfig.c:1407: error: initializer element is not constant
wanconfig.c:1407: error: (near initialization for ‘sym_table[81].val’)
wanconfig.c:1408: error: ‘WAN_E1_120’ undeclared here (not in a function)
wanconfig.c:1408: error: initializer element is not constant
wanconfig.c:1408: error: (near initialization for ‘sym_table[82].val’)
wanconfig.c:1409: error: ‘WAN_E1_75’ undeclared here (not in a function)
wanconfig.c:1409: error: initializer element is not constant
wanconfig.c:1409: error: (near initialization for ‘sym_table[83].val’)
wanconfig.c:1410: error: ‘WAN_NORMAL_CLK’ undeclared here (not in a function)
wanconfig.c:1410: error: initializer element is not constant
wanconfig.c:1410: error: (near initialization for ‘sym_table[84].val’)
wanconfig.c:1411: error: ‘WAN_MASTER_CLK’ undeclared here (not in a function)
wanconfig.c:1411: error: initializer element is not constant
wanconfig.c:1411: error: (near initialization for ‘sym_table[85].val’)
wanconfig.c:1412: error: ‘WANOPT_FE_OSC_CLOCK’ undeclared here (not in a function)
wanconfig.c:1412: error: initializer element is not constant
wanconfig.c:1412: error: (near initialization for ‘sym_table[86].val’)
wanconfig.c:1413: error: ‘WANOPT_FE_LINE_CLOCK’ undeclared here (not in a function)
wanconfig.c:1413: error: initializer element is not constant
wanconfig.c:1413: error: (near initialization for ‘sym_table[87].val’)
wanconfig.c:1414: error: ‘WAN_TE1_SIG_CAS’ undeclared here (not in a function)
wanconfig.c:1414: error: initializer element is not constant
wanconfig.c:1414: error: (near initialization for ‘sym_table[88].val’)
wanconfig.c:1415: error: ‘WAN_TE1_SIG_CCS’ undeclared here (not in a function)
wanconfig.c:1415: error: initializer element is not constant
wanconfig.c:1415: error: (near initialization for ‘sym_table[89].val’)
wanconfig.c:1418: error: ‘WAN_TE3_RDEVICE_ADTRAN’ undeclared here (not in a function)
wanconfig.c:1418: error: initializer element is not constant
wanconfig.c:1418: error: (near initialization for ‘sym_table[90].val’)
wanconfig.c:1419: error: ‘WAN_TE3_RDEVICE_DIGITALLINK’ undeclared here (not in a function)
wanconfig.c:1419: error: initializer element is not constant
wanconfig.c:1419: error: (near initialization for ‘sym_table[91].val’)
wanconfig.c:1420: error: ‘WAN_TE3_RDEVICE_KENTROX’ undeclared here (not in a function)
wanconfig.c:1420: error: initializer element is not constant
wanconfig.c:1420: error: (near initialization for ‘sym_table[92].val’)
wanconfig.c:1421: error: ‘WAN_TE3_RDEVICE_LARSCOM’ undeclared here (not in a function)
wanconfig.c:1421: error: initializer element is not constant
wanconfig.c:1421: error: (near initialization for ‘sym_table[93].val’)
wanconfig.c:1422: error: ‘WAN_TE3_RDEVICE_VERILINK’ undeclared here (not in a function)
wanconfig.c:1422: error: initializer element is not constant
wanconfig.c:1422: error: (near initialization for ‘sym_table[94].val’)
wanconfig.c:1423: error: ‘WAN_TE3_LIU_LB_NORMAL’ undeclared here (not in a function)
wanconfig.c:1423: error: initializer element is not constant
wanconfig.c:1423: error: (near initialization for ‘sym_table[95].val’)
wanconfig.c:1424: error: ‘WAN_TE3_LIU_LB_ANALOG’ undeclared here (not in a function)
wanconfig.c:1424: error: initializer element is not constant
wanconfig.c:1424: error: (near initialization for ‘sym_table[96].val’)
wanconfig.c:1425: error: ‘WAN_TE3_LIU_LB_REMOTE’ undeclared here (not in a function)
wanconfig.c:1425: error: initializer element is not constant
wanconfig.c:1425: error: (near initialization for ‘sym_table[97].val’)
wanconfig.c:1426: error: ‘WAN_TE3_LIU_LB_DIGITAL’ undeclared here (not in a function)
wanconfig.c:1426: error: initializer element is not constant
wanconfig.c:1426: error: (near initialization for ‘sym_table[98].val’)
wanconfig.c:1428: error: initializer element is not constant
wanconfig.c:1428: error: (near initialization for ‘sym_table[99].val’)
wanconfig.c:1429: error: initializer element is not constant
wanconfig.c:1429: error: (near initialization for ‘sym_table[100].val’)
wanconfig.c:1430: error: initializer element is not constant
wanconfig.c:1430: error: (near initialization for ‘sym_table[101].val’)
wanconfig.c:1431: error: ‘WANCONFIG_LAPB’ undeclared here (not in a function)
wanconfig.c:1431: error: initializer element is not constant
wanconfig.c:1431: error: (near initialization for ‘sym_table[102].val’)
wanconfig.c:1432: error: ‘WANCONFIG_XDLC’ undeclared here (not in a function)
wanconfig.c:1432: error: initializer element is not constant
wanconfig.c:1432: error: (near initialization for ‘sym_table[103].val’)
wanconfig.c:1433: error: ‘WANCONFIG_TTY’ undeclared here (not in a function)
wanconfig.c:1433: error: initializer element is not constant
wanconfig.c:1433: error: (near initialization for ‘sym_table[104].val’)
wanconfig.c:1434: error: initializer element is not constant
wanconfig.c:1434: error: (near initialization for ‘sym_table[105].val’)
wanconfig.c:1435: error: initializer element is not constant
wanconfig.c:1435: error: (near initialization for ‘sym_table[106].val’)
wanconfig.c:1436: error: initializer element is not constant
wanconfig.c:1436: error: (near initialization for ‘sym_table[107].val’)
wanconfig.c:1437: error: ‘WANCONFIG_XMTP2’ undeclared here (not in a function)
wanconfig.c:1437: error: initializer element is not constant
wanconfig.c:1437: error: (near initialization for ‘sym_table[108].val’)
wanconfig.c:1438: error: ‘WANCONFIG_LAPD’ undeclared here (not in a function)
wanconfig.c:1438: error: initializer element is not constant
wanconfig.c:1438: error: (near initialization for ‘sym_table[109].val’)
wanconfig.c:1439: error: initializer element is not constant
wanconfig.c:1439: error: (near initialization for ‘sym_table[110].val’)
wanconfig.c:1440: error: initializer element is not constant
wanconfig.c:1440: error: (near initialization for ‘sym_table[111].val’)
wanconfig.c:1441: error: initializer element is not constant
wanconfig.c:1441: error: (near initialization for ‘sym_table[112].val’)
wanconfig.c:1442: error: initializer element is not constant
wanconfig.c:1442: error: (near initialization for ‘sym_table[113].val’)
wanconfig.c:1443: error: initializer element is not constant
wanconfig.c:1443: error: (near initialization for ‘sym_table[114].val’)
wanconfig.c:1446: error: ‘WANOPT_SS7_ANSI’ undeclared here (not in a function)
wanconfig.c:1446: error: initializer element is not constant
wanconfig.c:1446: error: (near initialization for ‘sym_table[115].val’)
wanconfig.c:1447: error: ‘WANOPT_SS7_ITU’ undeclared here (not in a function)
wanconfig.c:1447: error: initializer element is not constant
wanconfig.c:1447: error: (near initialization for ‘sym_table[116].val’)
wanconfig.c:1448: error: ‘WANOPT_SS7_NTT’ undeclared here (not in a function)
wanconfig.c:1448: error: initializer element is not constant
wanconfig.c:1448: error: (near initialization for ‘sym_table[117].val’)
wanconfig.c:1450: error: ‘WANOPT_SS7_FISU’ undeclared here (not in a function)
wanconfig.c:1450: error: initializer element is not constant
wanconfig.c:1450: error: (near initialization for ‘sym_table[118].val’)
wanconfig.c:1451: error: ‘WANOPT_SS7_LSSU’ undeclared here (not in a function)
wanconfig.c:1451: error: initializer element is not constant
wanconfig.c:1451: error: (near initialization for ‘sym_table[119].val’)
wanconfig.c:1453: error: ‘WANOPT_SS7_MODE_128’ undeclared here (not in a function)
wanconfig.c:1453: error: initializer element is not constant
wanconfig.c:1453: error: (near initialization for ‘sym_table[120].val’)
wanconfig.c:1454: error: ‘WANOPT_SS7_MODE_4096’ undeclared here (not in a function)
wanconfig.c:1454: error: initializer element is not constant
wanconfig.c:1454: error: (near initialization for ‘sym_table[121].val’)
wanconfig.c:1456: error: ‘WANOPT_S50X’ undeclared here (not in a function)
wanconfig.c:1456: error: initializer element is not constant
wanconfig.c:1456: error: (near initialization for ‘sym_table[122].val’)
wanconfig.c:1457: error: ‘WANOPT_S51X’ undeclared here (not in a function)
wanconfig.c:1457: error: initializer element is not constant
wanconfig.c:1457: error: (near initialization for ‘sym_table[123].val’)
wanconfig.c:1458: error: ‘WANOPT_ADSL’ undeclared here (not in a function)
wanconfig.c:1458: error: initializer element is not constant
wanconfig.c:1458: error: (near initialization for ‘sym_table[124].val’)
wanconfig.c:1459: error: initializer element is not constant
wanconfig.c:1459: error: (near initialization for ‘sym_table[125].val’)
wanconfig.c:1460: error: ‘WANOPT_AFT’ undeclared here (not in a function)
wanconfig.c:1460: error: initializer element is not constant
wanconfig.c:1460: error: (near initialization for ‘sym_table[126].val’)
wanconfig.c:1463: error: ‘RFC_MODE_BRIDGED_ETH_LLC’ undeclared here (not in a function)
wanconfig.c:1463: error: initializer element is not constant
wanconfig.c:1463: error: (near initialization for ‘sym_table[127].val’)
wanconfig.c:1464: error: ‘RFC_MODE_BRIDGED_ETH_VC’ undeclared here (not in a function)
wanconfig.c:1464: error: initializer element is not constant
wanconfig.c:1464: error: (near initialization for ‘sym_table[128].val’)
wanconfig.c:1465: error: ‘RFC_MODE_ROUTED_IP_LLC’ undeclared here (not in a function)
wanconfig.c:1465: error: initializer element is not constant
wanconfig.c:1465: error: (near initialization for ‘sym_table[129].val’)
wanconfig.c:1466: error: ‘RFC_MODE_ROUTED_IP_VC’ undeclared here (not in a function)
wanconfig.c:1466: error: initializer element is not constant
wanconfig.c:1466: error: (near initialization for ‘sym_table[130].val’)
wanconfig.c:1467: error: ‘RFC_MODE_PPP_LLC’ undeclared here (not in a function)
wanconfig.c:1467: error: initializer element is not constant
wanconfig.c:1467: error: (near initialization for ‘sym_table[131].val’)
wanconfig.c:1468: error: ‘RFC_MODE_PPP_VC’ undeclared here (not in a function)
wanconfig.c:1468: error: initializer element is not constant
wanconfig.c:1468: error: (near initialization for ‘sym_table[132].val’)
wanconfig.c:1469: error: ‘RFC_MODE_STACK_VC’ undeclared here (not in a function)
wanconfig.c:1469: error: initializer element is not constant
wanconfig.c:1469: error: (near initialization for ‘sym_table[133].val’)
wanconfig.c:1472: error: initializer element is not constant
wanconfig.c:1472: error: (near initialization for ‘sym_table[134].val’)
wanconfig.c:1473: error: initializer element is not constant
wanconfig.c:1473: error: (near initialization for ‘sym_table[135].val’)
wanconfig.c:1474: error: ‘LAN_INTERFACE’ undeclared here (not in a function)
wanconfig.c:1474: error: initializer element is not constant
wanconfig.c:1474: error: (near initialization for ‘sym_table[136].val’)
wanconfig.c:1475: error: ‘WAN_INTERFACE’ undeclared here (not in a function)
wanconfig.c:1475: error: initializer element is not constant
wanconfig.c:1475: error: (near initialization for ‘sym_table[137].val’)
wanconfig.c:1477: error: ‘WANOPT_ADSL_T1_413’ undeclared here (not in a function)
wanconfig.c:1477: error: initializer element is not constant
wanconfig.c:1477: error: (near initialization for ‘sym_table[138].val’)
wanconfig.c:1478: error: ‘WANOPT_ADSL_G_LITE’ undeclared here (not in a function)
wanconfig.c:1478: error: initializer element is not constant
wanconfig.c:1478: error: (near initialization for ‘sym_table[139].val’)
wanconfig.c:1479: error: ‘WANOPT_ADSL_G_DMT’ undeclared here (not in a function)
wanconfig.c:1479: error: initializer element is not constant
wanconfig.c:1479: error: (near initialization for ‘sym_table[140].val’)
wanconfig.c:1480: error: ‘WANOPT_ADSL_ALCATEL_1_4’ undeclared here (not in a function)
wanconfig.c:1480: error: initializer element is not constant
wanconfig.c:1480: error: (near initialization for ‘sym_table[141].val’)
wanconfig.c:1481: error: ‘WANOPT_ADSL_ALCATEL’ undeclared here (not in a function)
wanconfig.c:1481: error: initializer element is not constant
wanconfig.c:1481: error: (near initialization for ‘sym_table[142].val’)
wanconfig.c:1482: error: ‘WANOPT_ADSL_MULTIMODE’ undeclared here (not in a function)
wanconfig.c:1482: error: initializer element is not constant
wanconfig.c:1482: error: (near initialization for ‘sym_table[143].val’)
wanconfig.c:1483: error: ‘WANOPT_ADSL_T1_413_AUTO’ undeclared here (not in a function)
wanconfig.c:1483: error: initializer element is not constant
wanconfig.c:1483: error: (near initialization for ‘sym_table[144].val’)
wanconfig.c:1484: error: ‘WANOPT_ADSL_TRELLIS_ENABLE’ undeclared here (not in a function)
wanconfig.c:1484: error: initializer element is not constant
wanconfig.c:1484: error: (near initialization for ‘sym_table[145].val’)
wanconfig.c:1485: error: ‘WANOPT_ADSL_TRELLIS_DISABLE’ undeclared here (not in a function)
wanconfig.c:1485: error: initializer element is not constant
wanconfig.c:1485: error: (near initialization for ‘sym_table[146].val’)
wanconfig.c:1486: error: ‘WANOPT_ADSL_TRELLIS_LITE_ONLY_DISABLE’ undeclared here (not in a function)
wanconfig.c:1486: error: initializer element is not constant
wanconfig.c:1486: error: (near initialization for ‘sym_table[147].val’)
wanconfig.c:1487: error: ‘WANOPT_ADSL_0DB_CODING_GAIN’ undeclared here (not in a function)
wanconfig.c:1487: error: initializer element is not constant
wanconfig.c:1487: error: (near initialization for ‘sym_table[148].val’)
wanconfig.c:1488: error: ‘WANOPT_ADSL_1DB_CODING_GAIN’ undeclared here (not in a function)
wanconfig.c:1488: error: initializer element is not constant
wanconfig.c:1488: error: (near initialization for ‘sym_table[149].val’)
wanconfig.c:1489: error: ‘WANOPT_ADSL_2DB_CODING_GAIN’ undeclared here (not in a function)
wanconfig.c:1489: error: initializer element is not constant
wanconfig.c:1489: error: (near initialization for ‘sym_table[150].val’)
wanconfig.c:1490: error: ‘WANOPT_ADSL_3DB_CODING_GAIN’ undeclared here (not in a function)
wanconfig.c:1490: error: initializer element is not constant
wanconfig.c:1490: error: (near initialization for ‘sym_table[151].val’)
wanconfig.c:1491: error: ‘WANOPT_ADSL_4DB_CODING_GAIN’ undeclared here (not in a function)
wanconfig.c:1491: error: initializer element is not constant
wanconfig.c:1491: error: (near initialization for ‘sym_table[152].val’)
wanconfig.c:1492: error: ‘WANOPT_ADSL_5DB_CODING_GAIN’ undeclared here (not in a function)
wanconfig.c:1492: error: initializer element is not constant
wanconfig.c:1492: error: (near initialization for ‘sym_table[153].val’)
wanconfig.c:1493: error: ‘WANOPT_ADSL_6DB_CODING_GAIN’ undeclared here (not in a function)
wanconfig.c:1493: error: initializer element is not constant
wanconfig.c:1493: error: (near initialization for ‘sym_table[154].val’)
wanconfig.c:1494: error: ‘WANOPT_ADSL_7DB_CODING_GAIN’ undeclared here (not in a function)
wanconfig.c:1494: error: initializer element is not constant
wanconfig.c:1494: error: (near initialization for ‘sym_table[155].val’)
wanconfig.c:1495: error: ‘WANOPT_ADSL_AUTO_CODING_GAIN’ undeclared here (not in a function)
wanconfig.c:1495: error: initializer element is not constant
wanconfig.c:1495: error: (near initialization for ‘sym_table[156].val’)
wanconfig.c:1496: error: ‘WANOPT_ADSL_RX_BIN_DISABLE’ undeclared here (not in a function)
wanconfig.c:1496: error: initializer element is not constant
wanconfig.c:1496: error: (near initialization for ‘sym_table[157].val’)
wanconfig.c:1497: error: ‘WANOPT_ADSL_RX_BIN_ENABLE’ undeclared here (not in a function)
wanconfig.c:1497: error: initializer element is not constant
wanconfig.c:1497: error: (near initialization for ‘sym_table[158].val’)
wanconfig.c:1498: error: ‘WANOPT_ADSL_FRAMING_TYPE_0’ undeclared here (not in a function)
wanconfig.c:1498: error: initializer element is not constant
wanconfig.c:1498: error: (near initialization for ‘sym_table[159].val’)
wanconfig.c:1499: error: ‘WANOPT_ADSL_FRAMING_TYPE_1’ undeclared here (not in a function)
wanconfig.c:1499: error: initializer element is not constant
wanconfig.c:1499: error: (near initialization for ‘sym_table[160].val’)
wanconfig.c:1500: error: ‘WANOPT_ADSL_FRAMING_TYPE_2’ undeclared here (not in a function)
wanconfig.c:1500: error: initializer element is not constant
wanconfig.c:1500: error: (near initialization for ‘sym_table[161].val’)
wanconfig.c:1501: error: ‘WANOPT_ADSL_FRAMING_TYPE_3’ undeclared here (not in a function)
wanconfig.c:1501: error: initializer element is not constant
wanconfig.c:1501: error: (near initialization for ‘sym_table[162].val’)
wanconfig.c:1502: error: ‘WANOPT_ADSL_EXPANDED_EXCHANGE’ undeclared here (not in a function)
wanconfig.c:1502: error: initializer element is not constant
wanconfig.c:1502: error: (near initialization for ‘sym_table[163].val’)
wanconfig.c:1503: error: ‘WANOPT_ADSL_SHORT_EXCHANGE’ undeclared here (not in a function)
wanconfig.c:1503: error: initializer element is not constant
wanconfig.c:1503: error: (near initialization for ‘sym_table[164].val’)
wanconfig.c:1504: error: ‘WANOPT_ADSL_CLOCK_CRYSTAL’ undeclared here (not in a function)
wanconfig.c:1504: error: initializer element is not constant
wanconfig.c:1504: error: (near initialization for ‘sym_table[165].val’)
wanconfig.c:1505: error: ‘WANOPT_ADSL_CLOCK_OSCILLATOR’ undeclared here (not in a function)
wanconfig.c:1505: error: initializer element is not constant
wanconfig.c:1505: error: (near initialization for ‘sym_table[166].val’)
wanconfig.c:1507: error: ‘IBM4680’ undeclared here (not in a function)
wanconfig.c:1507: error: initializer element is not constant
wanconfig.c:1507: error: (near initialization for ‘sym_table[167].val’)
wanconfig.c:1508: error: initializer element is not constant
wanconfig.c:1508: error: (near initialization for ‘sym_table[168].val’)
wanconfig.c:1509: error: ‘NCR2126’ undeclared here (not in a function)
wanconfig.c:1509: error: initializer element is not constant
wanconfig.c:1509: error: (near initialization for ‘sym_table[169].val’)
wanconfig.c:1510: error: ‘NCR2127’ undeclared here (not in a function)
wanconfig.c:1510: error: initializer element is not constant
wanconfig.c:1510: error: (near initialization for ‘sym_table[170].val’)
wanconfig.c:1511: error: ‘NCR1255’ undeclared here (not in a function)
wanconfig.c:1511: error: initializer element is not constant
wanconfig.c:1511: error: (near initialization for ‘sym_table[171].val’)
wanconfig.c:1512: error: ‘NCR7000’ undeclared here (not in a function)
wanconfig.c:1512: error: initializer element is not constant
wanconfig.c:1512: error: (near initialization for ‘sym_table[172].val’)
wanconfig.c:1513: error: ‘ICL’ undeclared here (not in a function)
wanconfig.c:1513: error: initializer element is not constant
wanconfig.c:1513: error: (near initialization for ‘sym_table[173].val’)
wanconfig.c:1518: error: ‘WANOPT_DSP_HPAD’ undeclared here (not in a function)
wanconfig.c:1518: error: initializer element is not constant
wanconfig.c:1518: error: (near initialization for ‘sym_table[174].val’)
wanconfig.c:1519: error: ‘WANOPT_DSP_TPAD’ undeclared here (not in a function)
wanconfig.c:1519: error: initializer element is not constant
wanconfig.c:1519: error: (near initialization for ‘sym_table[175].val’)
wanconfig.c:1521: error: ‘WANOPT_AUTO’ undeclared here (not in a function)
wanconfig.c:1521: error: initializer element is not constant
wanconfig.c:1521: error: (near initialization for ‘sym_table[176].val’)
wanconfig.c:1522: error: ‘WANOPT_MANUAL’ undeclared here (not in a function)
wanconfig.c:1522: error: initializer element is not constant
wanconfig.c:1522: error: (near initialization for ‘sym_table[177].val’)
wanconfig.c:1525: error: ‘WANOPT_TWO_WAY_ALTERNATE’ undeclared here (not in a function)
wanconfig.c:1525: error: initializer element is not constant
wanconfig.c:1525: error: (near initialization for ‘sym_table[178].val’)
wanconfig.c:1526: error: ‘WANOPT_TWO_WAY_SIMULTANEOUS’ undeclared here (not in a function)
wanconfig.c:1526: error: initializer element is not constant
wanconfig.c:1526: error: (near initialization for ‘sym_table[179].val’)
wanconfig.c:1527: error: ‘WANOPT_PRI_DISC_ON_NO_RESP’ undeclared here (not in a function)
wanconfig.c:1527: error: initializer element is not constant
wanconfig.c:1527: error: (near initialization for ‘sym_table[180].val’)
wanconfig.c:1528: error: ‘WANOPT_PRI_SNRM_ON_NO_RESP’ undeclared here (not in a function)
wanconfig.c:1528: error: initializer element is not constant
wanconfig.c:1528: error: (near initialization for ‘sym_table[181].val’)
wanconfig.c:1530: error: ‘WP_NONE’ undeclared here (not in a function)
wanconfig.c:1530: error: initializer element is not constant
wanconfig.c:1530: error: (near initialization for ‘sym_table[182].val’)
wanconfig.c:1531: error: ‘WP_SLINEAR’ undeclared here (not in a function)
wanconfig.c:1531: error: initializer element is not constant
wanconfig.c:1531: error: (near initialization for ‘sym_table[183].val’)
wanconfig.c:1533: error: ‘WAN_TDMV_ALAW’ undeclared here (not in a function)
wanconfig.c:1533: error: initializer element is not constant
wanconfig.c:1533: error: (near initialization for ‘sym_table[184].val’)
wanconfig.c:1534: error: ‘WAN_TDMV_MULAW’ undeclared here (not in a function)
wanconfig.c:1534: error: initializer element is not constant
wanconfig.c:1534: error: (near initialization for ‘sym_table[185].val’)
wanconfig.c: In function ‘main’:
wanconfig.c:1556: error: ‘WANPIPE_VERSION_BETA’ undeclared (first use in this function)
wanconfig.c:1556: error: (Each undeclared identifier is reported only once
wanconfig.c:1556: error: for each function it appears in.)
wanconfig.c:1558: error: ‘WANPIPE_VERSION’ undeclared (first use in this function)
wanconfig.c:1558: error: ‘WANPIPE_SUB_VERSION’ undeclared (first use in this function)
wanconfig.c:1558: warning: format ‘%s’ expects type ‘char *’, but argument 3 has type ‘struct look_up_t *’
wanconfig.c:1558: warning: format ‘%s’ expects type ‘char *’, but argument 4 has type ‘struct look_up_t *’
wanconfig.c:1561: warning: format ‘%s’ expects type ‘char *’, but argument 3 has type ‘struct look_up_t *’
wanconfig.c:1561: warning: format ‘%s’ expects type ‘char *’, but argument 4 has type ‘struct look_up_t *’
wanconfig.c:1632: error: ‘WANPIPE_COPYRIGHT_DATES’ undeclared (first use in this function)
wanconfig.c:1632: error: ‘WANPIPE_COMPANY’ undeclared (first use in this function)
wanconfig.c:1632: warning: format ‘%s’ expects type ‘char *’, but argument 2 has type ‘struct look_up_t *’
wanconfig.c:1632: warning: format ‘%s’ expects type ‘char *’, but argument 3 has type ‘struct look_up_t *’
wanconfig.c:1632: warning: format ‘%s’ expects type ‘char *’, but argument 4 has type ‘struct look_up_t *’
wanconfig.c:1632: warning: format ‘%s’ expects type ‘char *’, but argument 5 has type ‘struct look_up_t *’
wanconfig.c:1636: warning: format ‘%s’ expects type ‘char *’, but argument 2 has type ‘struct look_up_t *’
wanconfig.c:1636: warning: format ‘%s’ expects type ‘char *’, but argument 3 has type ‘struct look_up_t *’
wanconfig.c:1636: warning: format ‘%s’ expects type ‘char *’, but argument 4 has type ‘struct look_up_t *’
wanconfig.c:1636: warning: format ‘%s’ expects type ‘char *’, but argument 5 has type ‘struct look_up_t *’
wanconfig.c:1743: warning: comparison between pointer and integer
wanconfig.c:1745: warning: format ‘%d’ expects type ‘int’, but argument 4 has type ‘struct look_up_t *’
wanconfig.c:1749: warning: comparison between pointer and integer
wanconfig.c:1751: warning: format ‘%d’ expects type ‘int’, but argument 4 has type ‘struct look_up_t *’
wanconfig.c: In function ‘startup’:
wanconfig.c:1934: warning: comparison between pointer and integer
wanconfig.c: In function ‘wp_shutdown’:
wanconfig.c:2011: warning: comparison between pointer and integer
wanconfig.c: In function ‘router_down’:
wanconfig.c:2033: error: size of array ‘filename’ has non-integer type
wanconfig.c:2037: error: ‘link_def_t’ has no member named ‘linkconf’
wanconfig.c:2037: error: ‘wandev_conf_t’ undeclared (first use in this function)
wanconfig.c:2037: warning: passing argument 1 of ‘malloc’ makes integer from pointer without a cast
wanconfig.c:2037: warning: statement with no effect
wanconfig.c:2038: error: ‘link_def_t’ has no member named ‘linkconf’
wanconfig.c:2047: warning: comparison between pointer and integer
wanconfig.c:2071: error: ‘ROUTER_DOWN’ undeclared (first use in this function)
wanconfig.c:2071: error: ‘link_def_t’ has no member named ‘linkconf’
wanconfig.c:2071: warning: passing argument 2 of ‘ioctl’ makes integer from pointer without a cast
wanconfig.c:2093: error: ‘link_def_t’ has no member named ‘linkconf’
wanconfig.c:2093: error: ‘look_up_t’ has no member named ‘config_id’
wanconfig.c:2094: warning: implicit declaration of function ‘update_adsl_vci_vpi_list’
wanconfig.c:2094: error: ‘link_def_t’ has no member named ‘linkconf’
wanconfig.c:2094: error: ‘look_up_t’ has no member named ‘u’
wanconfig.c:2094: error: request for member ‘adsl’ in something not a structure or union
wanconfig.c:2094: error: request for member ‘vcivpi_list’ in something not a structure or union
wanconfig.c:2095: error: ‘link_def_t’ has no member named ‘linkconf’
wanconfig.c:2095: error: ‘look_up_t’ has no member named ‘u’
wanconfig.c:2095: error: request for member ‘adsl’ in something not a structure or union
wanconfig.c:2095: error: request for member ‘vcivpi_num’ in something not a structure or union
wanconfig.c:2098: error: ‘link_def_t’ has no member named ‘linkconf’
wanconfig.c:2099: error: ‘link_def_t’ has no member named ‘linkconf’
wanconfig.c:2099: warning: statement with no effect
wanconfig.c: In function ‘router_ifdel’:
wanconfig.c:2111: error: size of array ‘filename’ has non-integer type
wanconfig.c:2112: error: size of array ‘devicename’ has non-integer type
wanconfig.c:2118: warning: comparison between pointer and integer
wanconfig.c:2128: warning: comparison between pointer and integer
wanconfig.c:2148: error: ‘ROUTER_IFDEL’ undeclared (first use in this function)
wanconfig.c:2148: warning: passing argument 2 of ‘ioctl’ makes integer from pointer without a cast
wanconfig.c: In function ‘configure’:
wanconfig.c:2201: warning: passing argument 1 of ‘strlen’ from incompatible pointer type
wanconfig.c:2201: warning: passing argument 2 of ‘__builtin_strcmp’ from incompatible pointer type
wanconfig.c:2201: warning: passing argument 2 of ‘__builtin_strcmp’ from incompatible pointer type
wanconfig.c:2201: warning: passing argument 1 of ‘strlen’ from incompatible pointer type
wanconfig.c:2201: warning: passing argument 2 of ‘__builtin_strcmp’ from incompatible pointer type
wanconfig.c:2201: warning: passing argument 2 of ‘__builtin_strcmp’ from incompatible pointer type
wanconfig.c:2207: warning: format ‘%s’ expects type ‘char *’, but argument 2 has type ‘struct look_up_t *’
wanconfig.c: In function ‘build_linkdef_list’:
wanconfig.c:2292: warning: passing argument 1 of ‘__builtin_strncpy’ from incompatible pointer type
wanconfig.c:2292: warning: passing argument 3 of ‘__builtin_strncpy’ makes integer from pointer without a cast
wanconfig.c:2297: warning: passing argument 2 of ‘read_conf_section’ from incompatible pointer type
wanconfig.c:2299: error: ‘link_def_t’ has no member named ‘next’
wanconfig.c:2299: warning: statement with no effect
wanconfig.c: In function ‘build_chandef_list’:
wanconfig.c:2357: warning: passing argument 1 of ‘__builtin_strncpy’ from incompatible pointer type
wanconfig.c:2357: warning: passing argument 3 of ‘__builtin_strncpy’ makes integer from pointer without a cast
wanconfig.c:2383: warning: format ‘%s’ expects type ‘char *’, but argument 2 has type ‘struct look_up_t *’
wanconfig.c:2388: warning: format ‘%s’ expects type ‘char *’, but argument 2 has type ‘struct look_up_t *’
wanconfig.c:2433: warning: format ‘%s’ expects type ‘char *’, but argument 2 has type ‘struct look_up_t *’
wanconfig.c:2439: warning: format ‘%s’ expects type ‘char *’, but argument 2 has type ‘struct look_up_t *’
wanconfig.c:2474: error: ‘chan_def_t’ has no member named ‘next’
wanconfig.c:2475: error: ‘chan_def_t’ has no member named ‘next’
wanconfig.c:2475: warning: assignment from incompatible pointer type
wanconfig.c:2477: error: ‘chan_def_t’ has no member named ‘next’
wanconfig.c:2477: warning: statement with no effect
wanconfig.c:2481: error: ‘chan_def_t’ has no member named ‘link’
wanconfig.c:2481: warning: statement with no effect
wanconfig.c: In function ‘configure_link’:
wanconfig.c:2498: error: size of array ‘filename’ has non-integer type
wanconfig.c:2511: error: ‘link_def_t’ has no member named ‘linkconf’
wanconfig.c:2512: error: ‘link_def_t’ has no member named ‘linkconf’
wanconfig.c:2512: error: ‘look_up_t’ has no member named ‘data’
wanconfig.c:2512: error: ‘link_def_t’ has no member named ‘linkconf’
wanconfig.c:2512: error: ‘look_up_t’ has no member named ‘data’
wanconfig.c:2513: error: ‘link_def_t’ has no member named ‘linkconf’
wanconfig.c:2514: error: ‘link_def_t’ has no member named ‘linkconf’
wanconfig.c:2514: warning: statement with no effect
wanconfig.c:2517: error: ‘link_def_t’ has no member named ‘linkconf’
wanconfig.c:2517: error: ‘wandev_conf_t’ undeclared (first use in this function)
wanconfig.c:2517: warning: passing argument 1 of ‘malloc’ makes integer from pointer without a cast
wanconfig.c:2517: warning: statement with no effect
wanconfig.c:2518: error: ‘link_def_t’ has no member named ‘linkconf’
wanconfig.c:2522: error: ‘link_def_t’ has no member named ‘linkconf’
wanconfig.c:2522: warning: passing argument 3 of ‘memset’ makes integer from pointer without a cast
wanconfig.c:2523: error: ‘link_def_t’ has no member named ‘linkconf’
wanconfig.c:2523: error: ‘look_up_t’ has no member named ‘magic’
wanconfig.c:2523: error: ‘ROUTER_MAGIC’ undeclared (first use in this function)
wanconfig.c:2523: warning: statement with no effect
wanconfig.c:2524: error: ‘link_def_t’ has no member named ‘linkconf’
wanconfig.c:2524: error: ‘look_up_t’ has no member named ‘config_id’
wanconfig.c:2524: warning: statement with no effect
wanconfig.c:2542: error: ‘link_def_t’ has no member named ‘linkconf’
wanconfig.c:2545: error: ‘link_def_t’ has no member named ‘linkconf’
wanconfig.c:2545: error: ‘look_up_t’ has no member named ‘u’
wanconfig.c:2562: warning: format ‘%s’ expects type ‘char *’, but argument 4 has type ‘struct look_up_t *’
wanconfig.c:2572: error: ‘link_def_t’ has no member named ‘linkconf’
wanconfig.c:2572: error: ‘look_up_t’ has no member named ‘config_id’
wanconfig.c:2578: error: ‘chan_def_t’ has no member named ‘next’
wanconfig.c:2578: warning: assignment from incompatible pointer type
wanconfig.c:2591: error: ‘link_def_t’ has no member named ‘linkconf’
wanconfig.c:2591: error: ‘look_up_t’ has no member named ‘u’
wanconfig.c:2591: error: request for member ‘fr’ in something not a structure or union
wanconfig.c:2591: error: request for member ‘dlci’ in something not a structure or union
wanconfig.c:2591: error: incompatible types in assignment
wanconfig.c:2591: warning: statement with no effect
wanconfig.c:2592: error: ‘link_def_t’ has no member named ‘linkconf’
wanconfig.c:2592: error: ‘look_up_t’ has no member named ‘u’
wanconfig.c:2592: error: request for member ‘fr’ in something not a structure or union
wanconfig.c:2592: error: request for member ‘dlci’ in something not a structure or union
wanconfig.c:2592: error: invalid operands to binary >
wanconfig.c:2593: error: ‘link_def_t’ has no member named ‘linkconf’
wanconfig.c:2593: error: ‘look_up_t’ has no member named ‘u’
wanconfig.c:2593: error: request for member ‘fr’ in something not a structure or union
wanconfig.c:2593: error: request for member ‘dlci’ in something not a structure or union
wanconfig.c:2593: error: incompatible types in assignment
wanconfig.c:2593: warning: statement with no effect
wanconfig.c:2603: error: ‘link_def_t’ has no member named ‘linkconf’
wanconfig.c:2603: error: ‘look_up_t’ has no member named ‘config_id’
wanconfig.c:2604: warning: implicit declaration of function ‘read_adsl_vci_vpi_list’
wanconfig.c:2604: error: ‘link_def_t’ has no member named ‘linkconf’
wanconfig.c:2604: error: ‘look_up_t’ has no member named ‘u’
wanconfig.c:2604: error: request for member ‘adsl’ in something not a structure or union
wanconfig.c:2604: error: request for member ‘vcivpi_list’ in something not a structure or union
wanconfig.c:2605: error: ‘link_def_t’ has no member named ‘linkconf’
wanconfig.c:2605: error: ‘look_up_t’ has no member named ‘u’
wanconfig.c:2605: error: request for member ‘adsl’ in something not a structure or union
wanconfig.c:2605: error: request for member ‘vcivpi_num’ in something not a structure or union
wanconfig.c:2621: error: ‘link_def_t’ has no member named ‘linkconf’
wanconfig.c:2621: error: ‘look_up_t’ has no member named ‘ft1’
wanconfig.c:2621: warning: statement with no effect
wanconfig.c:2623: error: ‘link_def_t’ has no member named ‘linkconf’
wanconfig.c:2623: error: ‘look_up_t’ has no member named ‘ft1’
wanconfig.c:2623: warning: statement with no effect
wanconfig.c:2628: error: ‘link_def_t’ has no member named ‘linkconf’
wanconfig.c:2628: error: ‘look_up_t’ has no member named ‘data’
wanconfig.c:2628: warning: statement with no effect
wanconfig.c:2634: error: ‘chan_def_t’ has no member named ‘next’
wanconfig.c:2634: warning: assignment from incompatible pointer type
wanconfig.c:2638: warning: passing argument 1 of ‘__builtin_strncpy’ from incompatible pointer type
wanconfig.c:2638: warning: passing argument 2 of ‘__builtin_strncpy’ from incompatible pointer type
wanconfig.c:2638: warning: passing argument 3 of ‘__builtin_strncpy’ makes integer from pointer without a cast
wanconfig.c:2639: warning: passing argument 1 of ‘__builtin_strncpy’ from incompatible pointer type
wanconfig.c:2639: warning: passing argument 2 of ‘__builtin_strncpy’ from incompatible pointer type
wanconfig.c:2639: warning: passing argument 3 of ‘__builtin_strncpy’ makes integer from pointer without a cast
wanconfig.c:2642: warning: passing argument 1 of ‘__builtin_strncpy’ from incompatible pointer type
wanconfig.c:2642: warning: passing argument 2 of ‘__builtin_strncpy’ from incompatible pointer type
wanconfig.c:2642: warning: passing argument 3 of ‘__builtin_strncpy’ makes integer from pointer without a cast
wanconfig.c:2645: warning: passing argument 1 of ‘__builtin_strncpy’ from incompatible pointer type
wanconfig.c:2645: warning: passing argument 2 of ‘__builtin_strncpy’ from incompatible pointer type
wanconfig.c:2645: warning: passing argument 3 of ‘__builtin_strncpy’ makes integer from pointer without a cast
wanconfig.c:2650: warning: passing argument 1 of ‘strlen’ from incompatible pointer type
wanconfig.c:2650: warning: passing argument 2 of ‘__builtin_strcmp’ from incompatible pointer type
wanconfig.c:2650: warning: passing argument 2 of ‘__builtin_strcmp’ from incompatible pointer type
wanconfig.c:2650: warning: passing argument 1 of ‘strlen’ from incompatible pointer type
wanconfig.c:2650: warning: passing argument 2 of ‘__builtin_strcmp’ from incompatible pointer type
wanconfig.c:2650: warning: passing argument 2 of ‘__builtin_strcmp’ from incompatible pointer type
wanconfig.c:2658: warning: format ‘%s’ expects type ‘char *’, but argument 2 has type ‘struct look_up_t *’
wanconfig.c:2660: error: ‘chan_def_t’ has no member named ‘chanconf’
wanconfig.c:2661: error: ‘chan_def_t’ has no member named ‘chanconf’
wanconfig.c:2662: error: ‘chan_def_t’ has no member named ‘chanconf’
wanconfig.c:2662: warning: statement with no effect
wanconfig.c:2664: error: ‘chan_def_t’ has no member named ‘chanconf’
wanconfig.c:2664: error: ‘wanif_conf_t’ undeclared (first use in this function)
wanconfig.c:2664: warning: passing argument 1 of ‘malloc’ makes integer from pointer without a cast
wanconfig.c:2664: warning: statement with no effect
wanconfig.c:2665: error: ‘chan_def_t’ has no member named ‘chanconf’
wanconfig.c:2670: error: ‘chan_def_t’ has no member named ‘chanconf’
wanconfig.c:2670: warning: passing argument 3 of ‘memset’ makes integer from pointer without a cast
wanconfig.c:2671: error: ‘chan_def_t’ has no member named ‘chanconf’
wanconfig.c:2671: error: ‘look_up_t’ has no member named ‘magic’
wanconfig.c:2671: warning: statement with no effect
wanconfig.c:2672: error: ‘chan_def_t’ has no member named ‘chanconf’
wanconfig.c:2672: error: ‘look_up_t’ has no member named ‘config_id’
wanconfig.c:2672: warning: statement with no effect
wanconfig.c:2679: warning: passing argument 1 of ‘__builtin_strncpy’ from incompatible pointer type
wanconfig.c:2679: warning: passing argument 2 of ‘__builtin_strncpy’ from incompatible pointer type
wanconfig.c:2679: warning: passing argument 3 of ‘__builtin_strncpy’ makes integer from pointer without a cast
wanconfig.c: In function ‘exec_link_cmd’:
wanconfig.c:2690: error: ‘link_def_t’ has no member named ‘linkconf’
wanconfig.c:2692: warning: format ‘%s’ expects type ‘char *’, but argument 3 has type ‘struct look_up_t *’
wanconfig.c:2704: error: ‘ROUTER_VER’ undeclared (first use in this function)
wanconfig.c:2704: warning: passing argument 2 of ‘ioctl’ makes integer from pointer without a cast
wanconfig.c:2708: warning: format ‘%s’ expects type ‘char *’, but argument 4 has type ‘struct look_up_t *’
wanconfig.c:2710: warning: format ‘%s’ expects type ‘char *’, but argument 4 has type ‘struct look_up_t *’
wanconfig.c:2756: warning: format ‘%s’ expects type ‘char *’, but argument 4 has type ‘struct look_up_t *’
wanconfig.c:2774: error: ‘ROUTER_SETUP’ undeclared (first use in this function)
wanconfig.c:2774: error: ‘link_def_t’ has no member named ‘linkconf’
wanconfig.c:2774: warning: passing argument 2 of ‘ioctl’ makes integer from pointer without a cast
wanconfig.c:2777: warning: format ‘%s’ expects type ‘char *’, but argument 4 has type ‘struct look_up_t *’
wanconfig.c:2779: warning: format ‘%s’ expects type ‘char *’, but argument 4 has type ‘struct look_up_t *’
wanconfig.c: In function ‘configure_chan’:
wanconfig.c:2809: error: ‘chan_def_t’ has no member named ‘chanconf’
wanconfig.c:2814: error: ‘chan_def_t’ has no member named ‘chanconf’
wanconfig.c:2814: error: ‘look_up_t’ has no member named ‘name’
wanconfig.c:2814: warning: passing argument 1 of ‘__builtin_strncpy’ from incompatible pointer type
wanconfig.c:2814: warning: passing argument 2 of ‘__builtin_strncpy’ from incompatible pointer type
wanconfig.c:2814: warning: passing argument 3 of ‘__builtin_strncpy’ makes integer from pointer without a cast
wanconfig.c:2816: error: ‘chan_def_t’ has no member named ‘chanconf’
wanconfig.c:2816: error: ‘look_up_t’ has no member named ‘addr’
wanconfig.c:2816: error: ‘WAN_ADDRESS_SZ’ undeclared (first use in this function)
wanconfig.c:2816: warning: passing argument 1 of ‘__builtin_strncpy’ from incompatible pointer type
wanconfig.c:2816: warning: passing argument 3 of ‘__builtin_strncpy’ makes integer from pointer without a cast
wanconfig.c:2819: error: ‘chan_def_t’ has no member named ‘chanconf’
wanconfig.c:2819: error: ‘look_up_t’ has no member named ‘usedby’
wanconfig.c:2819: error: ‘USED_BY_FIELD’ undeclared (first use in this function)
wanconfig.c:2819: warning: passing argument 1 of ‘__builtin_strncpy’ from incompatible pointer type
wanconfig.c:2819: warning: passing argument 3 of ‘__builtin_strncpy’ makes integer from pointer without a cast
wanconfig.c:2823: error: ‘chan_def_t’ has no member named ‘chanconf’
wanconfig.c:2823: error: ‘look_up_t’ has no member named ‘u’
wanconfig.c:2825: error: ‘chan_def_t’ has no member named ‘chanconf’
wanconfig.c:2825: error: ‘look_up_t’ has no member named ‘label’
wanconfig.c:2825: error: ‘WAN_IF_LABEL_SZ’ undeclared (first use in this function)
wanconfig.c:2825: warning: passing argument 3 of ‘memcpy’ makes integer from pointer without a cast
wanconfig.c:2832: error: ‘chan_def_t’ has no member named ‘chanconf’
wanconfig.c:2832: error: ‘look_up_t’ has no member named ‘u’
wanconfig.c:2839: error: ‘chan_def_t’ has no member named ‘chanconf’
wanconfig.c:2839: error: ‘look_up_t’ has no member named ‘u’
wanconfig.c:2858: error: ‘chan_def_t’ has no member named ‘chanconf’
wanconfig.c:2864: error: ‘chan_def_t’ has no member named ‘chanconf’
wanconfig.c:2864: error: ‘look_up_t’ has no member named ‘u’
wanconfig.c:2872: error: ‘chan_def_t’ has no member named ‘chanconf’
wanconfig.c:2872: error: ‘look_up_t’ has no member named ‘u’
wanconfig.c:2915: error: ‘chan_def_t’ has no member named ‘chanconf’
wanconfig.c:2915: error: ‘look_up_t’ has no member named ‘u’
wanconfig.c:2916: error: ‘chan_def_t’ has no member named ‘chanconf’
wanconfig.c: In function ‘exec_chan_cmd’:
wanconfig.c:2938: error: ‘chan_def_t’ has no member named ‘chanconf’
wanconfig.c:2940: warning: format ‘%s’ expects type ‘char *’, but argument 3 has type ‘struct look_up_t *’
wanconfig.c:2953: error: ‘ROUTER_IFNEW’ undeclared (first use in this function)
wanconfig.c:2953: error: ‘chan_def_t’ has no member named ‘chanconf’
wanconfig.c:2953: warning: passing argument 2 of ‘ioctl’ makes integer from pointer without a cast
wanconfig.c:2955: warning: format ‘%s’ expects type ‘char *’, but argument 4 has type ‘struct look_up_t *’
wanconfig.c:2957: warning: format ‘%s’ expects type ‘char *’, but argument 4 has type ‘struct look_up_t *’
wanconfig.c:2970: error: ‘chan_def_t’ has no member named ‘link’
wanconfig.c:2970: warning: initialization from incompatible pointer type
wanconfig.c:2973: warning: comparison between pointer and integer
wanconfig.c:2974: warning: comparison between pointer and integer
wanconfig.c:2975: error: ‘chan_def_t’ has no member named ‘chanconf’
wanconfig.c:2975: error: ‘look_up_t’ has no member named ‘hwec’
wanconfig.c:2975: error: request for member ‘enable’ in something not a structure or union
wanconfig.c:2977: warning: passing argument 1 of ‘config_hwec’ from incompatible pointer type
wanconfig.c:2984: warning: passing argument 1 of ‘enable_hwec’ from incompatible pointer type
wanconfig.c:2984: warning: passing argument 2 of ‘enable_hwec’ from incompatible pointer type
wanconfig.c:2986: warning: passing argument 1 of ‘release_hwec’ from incompatible pointer type
wanconfig.c:2996: error: ‘chan_def_t’ has no member named ‘chanconf’
wanconfig.c:2996: error: ‘look_up_t’ has no member named ‘master’
wanconfig.c:2996: warning: passing argument 2 of ‘__builtin_strncpy’ from incompatible pointer type
wanconfig.c:2996: warning: passing argument 3 of ‘__builtin_strncpy’ makes integer from pointer without a cast
wanconfig.c:2998: error: ‘ROUTER_IFNEW_LAPB’ undeclared (first use in this function)
wanconfig.c:2998: error: ‘chan_def_t’ has no member named ‘chanconf’
wanconfig.c:2998: warning: passing argument 2 of ‘ioctl’ makes integer from pointer without a cast
wanconfig.c:2999: warning: format ‘%s’ expects type ‘char *’, but argument 4 has type ‘struct look_up_t *’
wanconfig.c:3001: warning: format ‘%s’ expects type ‘char *’, but argument 4 has type ‘struct look_up_t *’
wanconfig.c:3014: error: ‘chan_def_t’ has no member named ‘chanconf’
wanconfig.c:3014: error: ‘look_up_t’ has no member named ‘master’
wanconfig.c:3014: warning: passing argument 2 of ‘__builtin_strncpy’ from incompatible pointer type
wanconfig.c:3014: warning: passing argument 3 of ‘__builtin_strncpy’ makes integer from pointer without a cast
wanconfig.c:3016: error: ‘ROUTER_IFNEW_X25’ undeclared (first use in this function)
wanconfig.c:3016: error: ‘chan_def_t’ has no member named ‘chanconf’
wanconfig.c:3016: warning: passing argument 2 of ‘ioctl’ makes integer from pointer without a cast
wanconfig.c:3017: warning: format ‘%s’ expects type ‘char *’, but argument 4 has type ‘struct look_up_t *’
wanconfig.c:3019: warning: format ‘%s’ expects type ‘char *’, but argument 4 has type ‘struct look_up_t *’
wanconfig.c:3033: error: ‘chan_def_t’ has no member named ‘chanconf’
wanconfig.c:3033: error: ‘look_up_t’ has no member named ‘master’
wanconfig.c:3033: warning: passing argument 2 of ‘__builtin_strncpy’ from incompatible pointer type
wanconfig.c:3033: warning: passing argument 3 of ‘__builtin_strncpy’ makes integer from pointer without a cast
wanconfig.c:3034: error: ‘ROUTER_IFNEW_DSP’ undeclared (first use in this function)
wanconfig.c:3034: error: ‘chan_def_t’ has no member named ‘chanconf’
wanconfig.c:3034: warning: passing argument 2 of ‘ioctl’ makes integer from pointer without a cast
wanconfig.c:3035: warning: format ‘%s’ expects type ‘char *’, but argument 4 has type ‘struct look_up_t *’
wanconfig.c:3037: warning: format ‘%s’ expects type ‘char *’, but argument 4 has type ‘struct look_up_t *’
wanconfig.c:3061: error: ‘chan_def_t’ has no member named ‘chanconf’
wanconfig.c:3061: error: ‘look_up_t’ has no member named ‘master’
wanconfig.c:3061: warning: passing argument 2 of ‘__builtin_strncpy’ from incompatible pointer type
wanconfig.c:3061: warning: passing argument 3 of ‘__builtin_strncpy’ makes integer from pointer without a cast
wanconfig.c:3067: error: ‘ROUTER_IFNEW_LIP’ undeclared (first use in this function)
wanconfig.c:3067: error: ‘chan_def_t’ has no member named ‘chanconf’
wanconfig.c:3067: warning: passing argument 2 of ‘ioctl’ makes integer from pointer without a cast
wanconfig.c:3069: warning: format ‘%s’ expects type ‘char *’, but argument 4 has type ‘struct look_up_t *’
wanconfig.c:3071: warning: format ‘%s’ expects type ‘char *’, but argument 4 has type ‘struct look_up_t *’
wanconfig.c: In function ‘conf_file_down’:
wanconfig.c:3820: warning: passing argument 1 of ‘__builtin_strncpy’ from incompatible pointer type
wanconfig.c:3820: warning: passing argument 3 of ‘__builtin_strncpy’ makes integer from pointer without a cast
wanconfig.c:3822: warning: passing argument 1 of ‘router_down’ from incompatible pointer type
wanconfig.c:3795: warning: unused variable ‘devname’
wanconfig.c: In function ‘has_config_changed’:
wanconfig.c:3909: error: ‘link_def_t’ has no member named ‘next’
wanconfig.c:3909: warning: assignment from incompatible pointer type
wanconfig.c:3910: warning: passing argument 1 of ‘strlen’ from incompatible pointer type
wanconfig.c:3910: warning: passing argument 1 of ‘__builtin_strcmp’ from incompatible pointer type
wanconfig.c:3910: warning: passing argument 1 of ‘strlen’ from incompatible pointer type
wanconfig.c:3910: warning: passing argument 1 of ‘__builtin_strcmp’ from incompatible pointer type
wanconfig.c:3910: warning: passing argument 1 of ‘__builtin_strcmp’ from incompatible pointer type
wanconfig.c:3910: warning: passing argument 1 of ‘__builtin_strcmp’ from incompatible pointer type
wanconfig.c: In function ‘free_device_link’:
wanconfig.c:3941: error: ‘link_def_t’ has no member named ‘next’
wanconfig.c:3941: warning: assignment from incompatible pointer type
wanconfig.c:3942: warning: passing argument 1 of ‘strlen’ from incompatible pointer type
wanconfig.c:3942: warning: passing argument 1 of ‘__builtin_strcmp’ from incompatible pointer type
wanconfig.c:3942: warning: passing argument 1 of ‘strlen’ from incompatible pointer type
wanconfig.c:3942: warning: passing argument 1 of ‘__builtin_strcmp’ from incompatible pointer type
wanconfig.c:3942: warning: passing argument 1 of ‘__builtin_strcmp’ from incompatible pointer type
wanconfig.c:3942: warning: passing argument 1 of ‘__builtin_strcmp’ from incompatible pointer type
wanconfig.c:3955: error: ‘chan_def_t’ has no member named ‘next’
wanconfig.c:3955: warning: assignment from incompatible pointer type
wanconfig.c:3957: error: ‘chan_def_t’ has no member named ‘chanconf’
wanconfig.c:3958: error: ‘chan_def_t’ has no member named ‘chanconf’
wanconfig.c:3966: error: ‘link_def_t’ has no member named ‘next’
wanconfig.c:3966: warning: assignment from incompatible pointer type
wanconfig.c:3968: error: ‘link_def_t’ has no member named ‘next’
wanconfig.c:3968: error: ‘link_def_t’ has no member named ‘next’
wanconfig.c:3968: warning: statement with no effect
wanconfig.c:3970: warning: format ‘%s’ expects type ‘char *’, but argument 3 has type ‘struct look_up_t *’
wanconfig.c:3971: error: ‘link_def_t’ has no member named ‘linkconf’
wanconfig.c:3972: error: ‘link_def_t’ has no member named ‘linkconf’
wanconfig.c: In function ‘free_linkdefs’:
wanconfig.c:3999: error: ‘chan_def_t’ has no member named ‘next’
wanconfig.c:3999: warning: assignment from incompatible pointer type
wanconfig.c:4001: error: ‘chan_def_t’ has no member named ‘chanconf’
wanconfig.c:4002: error: ‘chan_def_t’ has no member named ‘chanconf’
wanconfig.c:4010: error: ‘link_def_t’ has no member named ‘linkconf’
wanconfig.c:4011: error: ‘link_def_t’ has no member named ‘linkconf’
wanconfig.c:4014: error: ‘link_def_t’ has no member named ‘next’
wanconfig.c:4014: warning: assignment from incompatible pointer type
wanconfig.c: In function ‘device_syncup’:
wanconfig.c:4034: warning: passing argument 2 of ‘has_config_changed’ from incompatible pointer type
wanconfig.c: In function ‘start_chan’:
wanconfig.c:4083: error: ‘chan_def_t’ has no member named ‘next’
wanconfig.c:4083: warning: assignment from incompatible pointer type
wanconfig.c:4087: warning: passing argument 1 of ‘__builtin_strncpy’ from incompatible pointer type
wanconfig.c:4087: warning: passing argument 2 of ‘__builtin_strncpy’ from incompatible pointer type
wanconfig.c:4087: warning: passing argument 3 of ‘__builtin_strncpy’ makes integer from pointer without a cast
wanconfig.c:4088: warning: passing argument 1 of ‘__builtin_strncpy’ from incompatible pointer type
wanconfig.c:4088: warning: passing argument 2 of ‘__builtin_strncpy’ from incompatible pointer type
wanconfig.c:4088: warning: passing argument 3 of ‘__builtin_strncpy’ makes integer from pointer without a cast
wanconfig.c:4091: warning: passing argument 1 of ‘__builtin_strncpy’ from incompatible pointer type
wanconfig.c:4091: warning: passing argument 2 of ‘__builtin_strncpy’ from incompatible pointer type
wanconfig.c:4091: warning: passing argument 3 of ‘__builtin_strncpy’ makes integer from pointer without a cast
wanconfig.c:4094: warning: passing argument 1 of ‘__builtin_strncpy’ from incompatible pointer type
wanconfig.c:4094: warning: passing argument 2 of ‘__builtin_strncpy’ from incompatible pointer type
wanconfig.c:4094: warning: passing argument 3 of ‘__builtin_strncpy’ makes integer from pointer without a cast
wanconfig.c:4098: warning: passing argument 1 of ‘strlen’ from incompatible pointer type
wanconfig.c:4098: warning: passing argument 1 of ‘__builtin_strcmp’ from incompatible pointer type
wanconfig.c:4098: warning: passing argument 1 of ‘strlen’ from incompatible pointer type
wanconfig.c:4098: warning: passing argument 1 of ‘__builtin_strcmp’ from incompatible pointer type
wanconfig.c:4098: warning: passing argument 1 of ‘__builtin_strcmp’ from incompatible pointer type
wanconfig.c:4098: warning: passing argument 1 of ‘__builtin_strcmp’ from incompatible pointer type
wanconfig.c:4105: warning: format ‘%s’ expects type ‘char *’, but argument 2 has type ‘struct look_up_t *’
wanconfig.c: In function ‘start_link’:
wanconfig.c:4150: error: ‘link_def_t’ has no member named ‘next’
wanconfig.c:4150: warning: assignment from incompatible pointer type
wanconfig.c:4151: warning: passing argument 2 of ‘has_config_changed’ from incompatible pointer type
wanconfig.c:4152: warning: passing argument 1 of ‘device_syncup’ from incompatible pointer type
wanconfig.c:4164: error: ‘link_def_t’ has no member named ‘next’
wanconfig.c:4164: warning: assignment from incompatible pointer type
wanconfig.c:4166: warning: passing argument 1 of ‘strlen’ from incompatible pointer type
wanconfig.c:4166: warning: passing argument 1 of ‘__builtin_strcmp’ from incompatible pointer type
wanconfig.c:4166: warning: passing argument 1 of ‘strlen’ from incompatible pointer type
wanconfig.c:4166: warning: passing argument 1 of ‘__builtin_strcmp’ from incompatible pointer type
wanconfig.c:4166: warning: passing argument 1 of ‘__builtin_strcmp’ from incompatible pointer type
wanconfig.c:4166: warning: passing argument 1 of ‘__builtin_strcmp’ from incompatible pointer type
wanconfig.c:4171: warning: pointer type mismatch in conditional expression
wanconfig.c:4171: warning: format ‘%s’ expects type ‘char *’, but argument 2 has type ‘struct look_up_t *’
wanconfig.c:4171: warning: format ‘%s’ expects type ‘char *’, but argument 3 has type ‘void *’
wanconfig.c:4175: warning: format ‘%s’ expects type ‘char *’, but argument 4 has type ‘struct look_up_t *’
wanconfig.c:4182: error: ‘link_def_t’ has no member named ‘linkconf’
wanconfig.c:4182: error: ‘look_up_t’ has no member named ‘ft1’
wanconfig.c:4182: warning: statement with no effect
wanconfig.c: In function ‘stop_link’:
wanconfig.c:4227: error: ‘link_def_t’ has no member named ‘next’
wanconfig.c:4227: warning: assignment from incompatible pointer type
wanconfig.c:4232: warning: format ‘%s’ expects type ‘char *’, but argument 2 has type ‘struct look_up_t *’
wanconfig.c:4234: warning: passing argument 1 of ‘router_down’ from incompatible pointer type
wanconfig.c: In function ‘debugging’:
wanconfig.c:4717: error: size of array ‘filename’ has non-integer type
wanconfig.c:4738: error: ‘union <anonymous>’ has no member named ‘linkconf’
wanconfig.c:4738: error: ‘wandev_conf_t’ undeclared (first use in this function)
wanconfig.c:4738: warning: passing argument 3 of ‘memset’ makes integer from pointer without a cast
wanconfig.c:4739: error: ‘union <anonymous>’ has no member named ‘linkconf’
wanconfig.c:4739: error: request for member ‘magic’ in something not a structure or union
wanconfig.c:4739: error: ‘ROUTER_MAGIC’ undeclared (first use in this function)
wanconfig.c:4739: warning: statement with no effect
wanconfig.c: In function ‘debug_read’:
wanconfig.c:4765: error: size of array ‘filename’ has non-integer type
wanconfig.c:4766: error: ‘wan_kernel_msg_t’ undeclared (first use in this function)
wanconfig.c:4766: warning: statement with no effect
wanconfig.c:4766: error: expected ‘;’ before ‘wan_kernel_msg’
wanconfig.c:4787: error: ‘union <anonymous>’ has no member named ‘linkconf’
wanconfig.c:4787: error: ‘wandev_conf_t’ undeclared (first use in this function)
wanconfig.c:4787: warning: passing argument 3 of ‘memset’ makes integer from pointer without a cast
wanconfig.c:4788: error: ‘union <anonymous>’ has no member named ‘linkconf’
wanconfig.c:4788: error: request for member ‘magic’ in something not a structure or union
wanconfig.c:4788: error: ‘ROUTER_MAGIC’ undeclared (first use in this function)
wanconfig.c:4788: warning: statement with no effect
wanconfig.c:4794: error: ‘wan_kernel_msg’ undeclared (first use in this function)
wanconfig.c:4794: warning: passing argument 3 of ‘memset’ makes integer from pointer without a cast
wanconfig.c:4795: error: request for member ‘magic’ in something not a structure or union
wanconfig.c:4795: warning: statement with no effect
wanconfig.c:4796: error: request for member ‘max_len’ in something not a structure or union
wanconfig.c:4796: warning: statement with no effect
wanconfig.c:4797: error: request for member ‘data’ in something not a structure or union
wanconfig.c:4797: warning: statement with no effect
wanconfig.c:4798: error: request for member ‘data’ in something not a structure or union
wanconfig.c:4806: error: ‘ROUTER_DEBUG_READ’ undeclared (first use in this function)
wanconfig.c:4806: warning: passing argument 2 of ‘ioctl’ makes integer from pointer without a cast
wanconfig.c:4813: error: request for member ‘len’ in something not a structure or union
wanconfig.c:4815: error: request for member ‘len’ in something not a structure or union
wanconfig.c:4815: warning: comparison between pointer and integer
wanconfig.c:4816: error: request for member ‘data’ in something not a structure or union
wanconfig.c:4819: error: request for member ‘is_more’ in something not a structure or union
wanconfig.c:4828: error: request for member ‘data’ in something not a structure or union
wanconfig.c: At top level:
wanconfig.c:4834: error: expected ‘)’ before ‘*’ token
wanconfig.c:4870: error: expected ‘)’ before ‘*’ token
wanconfig.c: In function ‘parse_active_channel’:
wanconfig.c:4918: error: ‘ENABLE_ALL_CHANNELS’ undeclared (first use in this function)
wanconfig.c:4918: warning: return makes integer from pointer without a cast
make: *** [wanconfig] Error 1
